{"text_format":"3","workbook":"xlsx","n_sheets":9,"sheets":["ACI 1","ACI 2","ACI 3","ACI 4","ACI 5","ACI 6","Average ACI","Trending","Comparison Graph"],"not_rendered":{"charts":9,"images":2,"defined_names":14},"unopened":[{"sheet":"Comparison Graph","index":8,"reason":"not_a_worksheet"}],"read":"whole","date_system":"1900"}

{"sheet":"ACI 1","index":0,"n_rows":78,"n_cols":10,"rows_kept":78,"merged":[[16,0,17,0],[16,1,17,1],[16,2,17,2],[16,3,17,3],[16,4,17,4],[16,6,17,6],[16,7,17,7],[16,8,17,8],[16,9,17,9],[18,8,19,8],[18,9,19,9],[20,8,21,8],[20,9,21,9],[22,8,23,8],[22,9,23,9],[24,8,25,8],[24,9,25,9],[26,8,27,8],[26,9,27,9],[28,8,29,8],[28,9,29,9],[30,8,31,8],[30,9,31,9],[32,0,32,1],[32,8,33,8],[32,9,33,9],[33,0,33,1],[34,0,34,1],[34,8,35,8],[34,9,35,9],[35,0,35,1],[36,0,36,1],[36,8,37,8],[36,9,37,9],[37,0,37,1],[38,8,39,8],[38,9,39,9],[39,0,40,0],[39,1,40,1],[39,2,40,2],[39,3,40,3],[39,4,40,4],[40,8,41,8],[40,9,41,9],[42,8,43,8],[42,9,43,9],[68,0,69,1]]}
["QUALITY CONTROL DEPARTMENT"]
["MES-013-07 Andersen Cascade Impactor Result Sheet for Flowrate of 60L/min"]
["Associated Documents: TM-003"]
["To be used with Excel 2016 only. Last Modified by P. Lillo 05-Feb-19."]
[]
["First Replicate Result"]
[]
["Date Tested:","{Fill in}","Flow rate, LPM:","{Fill in}","Lab Sample No.:","{Fill in}","LC-MS Sequence File Name:",null,"{Fill in}"]
["TRF No.:","{Fill in}","Device Type:","{Fill in}","Sample ID:","{Fill in}","Calibration Reference (s):",null,"{Fill in}"]
["Product Batch:","{Fill in}","Device IGN:","{Fill in}","Device ID:","{Fill in}","LC-MS Database:",null,"{Fill in}"]
["Nominal Fill Weight, mg: ","{Fill in}","Average DU, mg:","{Fill in}","Practical By:","{Fill in}","Date Reported: ",null,"{Fill in}"]
["Product Name:","{Fill in}","Label Claim:","{Fill in}",null,null,"Reported By:",null,"{Fill in}"]
[]
["Description of Test Purpose (include storage conditions and/or timepoint if applicable):"]
["{Fill in}"]
[]
["Sample","Conc (µg/mL)","Volume (mL)","Dilution\n(e.g. 1/2)","Amount per Capsule (mg)",null,"Sample ","µg/mL Injection Concentration","µg/mL Average Concentration","% Difference"]
[]
["Capsule",{"$f":"+I19","v":{"$error":"#DIV/0!"}},"{Fill in}",{"v":1,"d":"1.0"},{"$f":"IF(H19=\"{Fill in}\",\"N/A\",(B19*C19)/(D19*1000))","v":"N/A"},null,"Capsule","{Fill in}",{"$f":"AVERAGE(H19:H20)","v":{"$error":"#DIV/0!"}},{"$f":"(((MAX(H19:H20))-(MIN(H19:H20)))/I19)*100","v":{"$error":"#DIV/0!"}}]
["Inhaler",{"$f":"+I21","v":{"$error":"#DIV/0!"}},"{Fill in}",{"v":1,"d":"1.0"},{"$f":"IF(H21=\"{Fill in}\",\"N/A\",(B20*C20)/(D20*1000))","v":"N/A"},null,"Capsule","{Fill in}"]
["Adpt, Thrt, Pre-sep",{"$f":"+I23","v":{"$error":"#DIV/0!"}},"{Fill in}",{"v":1,"d":"1.0"},{"$f":"IF(H23=\"{Fill in}\",\"N/A\",(B21*C21)/(D21*1000))","v":"N/A"},null,"Inhaler","{Fill in}",{"$f":"AVERAGE(H21:H22)","v":{"$error":"#DIV/0!"}},{"$f":"(((MAX(H21:H22))-(MIN(H21:H22)))/I21)*100","v":{"$error":"#DIV/0!"}}]
["Stage -1",{"$f":"+I25","v":{"$error":"#DIV/0!"}},"{Fill in}",{"v":1,"d":"1.0"},{"$f":"IF(H25=\"{Fill in}\",\"N/A\",(B22*C22)/(D22*1000))","v":"N/A"},null,"Inhaler","{Fill in}"]
["Stage -0",{"$f":"+I27","v":{"$error":"#DIV/0!"}},"{Fill in}",{"v":1,"d":"1.0"},{"$f":"IF(H27=\"{Fill in}\",\"N/A\",(B23*C23)/(D23*1000))","v":"N/A"},null,"Adpt, Thrt, Pre-sep","{Fill in}",{"$f":"AVERAGE(H23:H24)","v":{"$error":"#DIV/0!"}},{"$f":"(((MAX(H23:H24))-(MIN(H23:H24)))/I23)*100","v":{"$error":"#DIV/0!"}}]
["Stage 1",{"$f":"+I29","v":{"$error":"#DIV/0!"}},"{Fill in}",{"v":1,"d":"1.0"},{"$f":"IF(H29=\"{Fill in}\",\"N/A\",(B24*C24)/(D24*1000))","v":"N/A"},null,"Adpt, Thrt, Pre-sep","{Fill in}"]
["Stage 2",{"$f":"+I31","v":{"$error":"#DIV/0!"}},"{Fill in}",{"v":1,"d":"1.0"},{"$f":"IF(H31=\"{Fill in}\",\"N/A\",(B25*C25)/(D25*1000))","v":"N/A"},null,"Stage -1","{Fill in}",{"$f":"AVERAGE(H25:H26)","v":{"$error":"#DIV/0!"}},{"$f":"(((MAX(H25:H26))-(MIN(H25:H26)))/I25)*100","v":{"$error":"#DIV/0!"}}]
["Stage 3",{"$f":"+I33","v":{"$error":"#DIV/0!"}},"{Fill in}",{"v":1,"d":"1.0"},{"$f":"IF(H33=\"{Fill in}\",\"N/A\",(B26*C26)/(D26*1000))","v":"N/A"},null,"Stage -1","{Fill in}"]
["Stage 4",{"$f":"+I35","v":{"$error":"#DIV/0!"}},"{Fill in}",{"v":1,"d":"1.0"},{"$f":"IF(H35=\"{Fill in}\",\"N/A\",(B27*C27)/(D27*1000))","v":"N/A"},null,"Stage -0","{Fill in}",{"$f":"AVERAGE(H27:H28)","v":{"$error":"#DIV/0!"}},{"$f":"(((MAX(H27:H28))-(MIN(H27:H28)))/I27)*100","v":{"$error":"#DIV/0!"}}]
["Stage 5",{"$f":"+I37","v":{"$error":"#DIV/0!"}},"{Fill in}",{"v":1,"d":"1.0"},{"$f":"IF(H37=\"{Fill in}\",\"N/A\",(B28*C28)/(D28*1000))","v":"N/A"},null,"Stage -0 ","{Fill in}"]
["Stage 6",{"$f":"+I39","v":{"$error":"#DIV/0!"}},"{Fill in}",{"v":1,"d":"1.0"},{"$f":"IF(H39=\"{Fill in}\",\"N/A\",(B29*C29)/(D29*1000))","v":"N/A"},null,"Stage 1","{Fill in}",{"$f":"AVERAGE(H29:H30)","v":{"$error":"#DIV/0!"}},{"$f":"(((MAX(H29:H30))-(MIN(H29:H30)))/I29)*100","v":{"$error":"#DIV/0!"}}]
["Filter",{"$f":"+I41","v":{"$error":"#DIV/0!"}},"{Fill in}",{"v":1,"d":"1.0"},{"$f":"IF(H41=\"{Fill in}\",\"N/A\",(B30*C30)/(D30*1000))","v":"N/A"},null,"Stage 1","{Fill in}"]
["Casing",{"$f":"+I43","v":{"$error":"#DIV/0!"}},"{Fill in}",{"v":1,"d":"1.0"},{"$f":"IF(H43=\"{Fill in}\",\"N/A\",(B31*C31)/(D31*1000))","v":"N/A"},null,"Stage 2","{Fill in}",{"$f":"AVERAGE(H31:H32)","v":{"$error":"#DIV/0!"}},{"$f":"(((MAX(H31:H32))-(MIN(H31:H32)))/I31)*100","v":{"$error":"#DIV/0!"}}]
[{"$nulls":6},"Stage 2","{Fill in}"]
["Fine Particle Fraction (%)",null,{"$f":"IF(D57=\"N/A\",\"N/A\",D57/C35*100)","v":"N/A"},{"$nulls":3},"Stage 3","{Fill in}",{"$f":"AVERAGE(H33:H34)","v":{"$error":"#DIV/0!"}},{"$f":"(((MAX(H33:H34))-(MIN(H33:H34)))/I33)*100","v":{"$error":"#DIV/0!"}}]
["Total Amount (mg)",null,{"$f":"IF(H19=\"{Fill in}\",\"N/A\",SUM(E19:E31))","v":"N/A"}," ",null,null,"Stage 3","{Fill in}"]
["Amount Emitted to ACI (mg)",null,{"$f":"IF(E21=\"N/A\",\"N/A\",SUM(E21:E31))","v":"N/A"},{"$nulls":3},"Stage 4","{Fill in}",{"$f":"AVERAGE(H35:H36)","v":{"$error":"#DIV/0!"}},{"$f":"(((MAX(H35:H36))-(MIN(H35:H36)))/I35)*100","v":{"$error":"#DIV/0!"}}]
["% Mass Balance of Label Claim",null,{"$f":"IF(C35=\"N/A\", \"N/A\", ((C35/D12)*100))","v":"N/A"},{"$nulls":3},"Stage 4","{Fill in}"]
["Recovery %, Fill weight",null,{"$f":"IF(H19=\"{Fill in}\",\"N/A\",100*C34/B11)","v":"N/A"},{"$nulls":3},"Stage 5","{Fill in}",{"$f":"AVERAGE(H37:H38)","v":{"$error":"#DIV/0!"}},{"$f":"(((MAX(H37:H38))-(MIN(H37:H38)))/I37)*100","v":{"$error":"#DIV/0!"}}]
[" Recovery %, DU result (75-125%)",null,{"$f":"IF(D11=\"{Fill in}\", \"N/A\", 100*C35/D11)","v":"N/A"},{"$f":"IF((ROUND(C38,0))<75,\"LOW\",(IF((ROUND(C38,0))<=125,\"COMPLIES\",\"HIGH\")))","v":{"$error":"#VALUE!"}},null,null,"Stage 5","{Fill in}"]
[{"$nulls":6},"Stage 6","{Fill in}",{"$f":"AVERAGE(H39:H40)","v":{"$error":"#DIV/0!"}},{"$f":"(((MAX(H39:H40))-(MIN(H39:H40)))/I39)*100","v":{"$error":"#DIV/0!"}}]
["Cumulative Stage","Cut off Diameter (µm)","Ln (Cut off diameter)","Cumulative Mass per Capsule (mg)","Cumulative Fraction %",null,"Stage 6","{Fill in}"]
[{"$nulls":6},"Filter","{Fill in}",{"$f":"AVERAGE(H41:H42)","v":{"$error":"#DIV/0!"}},{"$f":"(((MAX(H41:H42))-(MIN(H41:H42)))/I41)*100","v":{"$error":"#DIV/0!"}}]
["C"," ",null,{"$f":"D43+E22","v":{"$error":"#VALUE!"}},{"$f":"100*(D42/$D$42)","v":{"$error":"#VALUE!"}},null,"Filter","{Fill in}"]
["C0",8.6,{"$f":"LN(B43)","v":{"v":2.151762203259462,"d":"2.2"}},{"$error":"#VALUE!"},{"$f":"100*(D43/$D$42)","v":{"$error":"#VALUE!"}},null,"Casing","{Fill in}",{"$f":"AVERAGE(H43:H44)","v":{"$error":"#DIV/0!"}},{"$f":"(((MAX(H43:H44))-(MIN(H43:H44)))/I43)*100","v":{"$error":"#DIV/0!"}}]
["C1",6.5,{"$f":"LN(B44)","v":{"v":1.8718021769015913,"d":"1.9"}},{"$error":"#VALUE!"},{"$error":"#VALUE!"},null,"Casing","{Fill in}"]
["C2",4.4,{"v":1.4816045409242156,"d":"1.5"},{"$error":"#VALUE!"},{"$error":"#VALUE!"}]
["C3",3.2,{"v":1.1631508098056809,"d":"1.2"},{"$error":"#VALUE!"},{"$error":"#VALUE!"}]
["C4",1.9,{"v":0.6418538861723947,"d":"0.6"},{"$error":"#VALUE!"},{"$error":"#VALUE!"}]
["C5",1.2,{"v":0.1823215567939546,"d":"0.2"},{"$error":"#VALUE!"},{"$error":"#VALUE!"}]
["C6",0.55,{"v":-0.5978370007556204,"d":"-0.6"},{"$error":"#VALUE!"},{"$error":"#VALUE!"}]
["C7",0.26,{"v":-1.3470736479666092,"d":"-1.3"},{"$f":"E30","v":"N/A"},{"$error":"#VALUE!"}]
[]
["FPD (mg < 5 µm)",null,"y  =  m Ln (5) + c"]
[]
["m","c","r2"]
[{"$f":"LINEST(D44:D46,C44:C46)","v":{"$error":"#VALUE!"}},{"$error":"#VALUE!"},{"$f":"POWER((CORREL(D44:D46,C44:C46)),2)","v":{"$error":"#VALUE!"}}]
[]
["FPD per Capsule (< 5µm, mg) =",null,null,{"$f":"IF(B8=\"{Fill in}\",\"N/A\",A55*LN(5)+B55)","v":"N/A"}]
[]
["MMAD and GSD",null,"x = Exp((y - c)/m)"]
[]
["y, Cumulative %","m","c","r2","x, Diameter, µm"]
[50,{"$f":"LINEST(E44:E46,C44:C46)","v":{"$error":"#VALUE!"}},{"$error":"#VALUE!"},{"$f":"POWER((CORREL(E44:E46,C44:C46)),2)","v":{"$error":"#VALUE!"}},{"$f":"EXP((A62-C62)/B62)","v":{"$error":"#VALUE!"}}]
[15.87,{"$f":"LINEST(E46:E48,C46:C48)","v":{"$error":"#VALUE!"}},{"$error":"#VALUE!"},{"$f":"POWER((CORREL(E46:E48,C46:C48)),2)","v":{"$error":"#VALUE!"}},{"$f":"EXP((A63-C63)/B63)","v":{"$error":"#VALUE!"}}]
[84.13,{"$f":"LINEST(E43:E45,C43:C45)","v":{"$error":"#VALUE!"}},{"$error":"#VALUE!"},{"$f":"POWER((CORREL(E43:E45,C43:C45)),2)","v":{"$error":"#VALUE!"}},{"$f":"EXP((A64-C64)/B64)","v":{"$error":"#VALUE!"}}]
[]
["MMAD, µm :",{"$f":"IF(B8=\"{Fill in}\",\"N/A\",E62)","v":"N/A"}]
["GSD :",{"$f":"IF(B8=\"{Fill in}\",\"N/A\",SQRT(E64/E63))","v":"N/A"}]
[]
["Mannitol Recovered from Stage Groupings (mg)"]
[]
["ATP to Stage -0",{"$f":"IF(B11=40,IF(E21=\"N/A\",\"N/A\",(IF(E22=\"N/A\",\"N/A\",(IF(E23=\"N/A\",\"N/A\",SUM(E21:E23)))))),\"N/A\")","v":"N/A"}]
["Stages 1 to 3",{"$f":"IF(B11=40,IF(E24=\"N/A\",\"N/A\",(IF(E25=\"N/A\",\"N/A\",(IF(E26=\"N/A\",\"N/A\",SUM(E24:E26)))))),\"N/A\")","v":"N/A"}]
["Stages 4 to 6",{"$f":"IF(B11=40,IF(E27=\"N/A\",\"N/A\",(IF(E28=\"N/A\",\"N/A\",(IF(E29=\"N/A\",\"N/A\",SUM(E27:E29)))))),\"N/A\")","v":"N/A"}]
["Filter",{"$f":"IF(B11=40, E30, \"N/A\")","v":"N/A"}]
[]
[]
["Reported By:"]
["(Sign & Date)"]

{"sheet":"ACI 2","index":1,"n_rows":78,"n_cols":10,"rows_kept":78,"merged":[[16,0,17,0],[16,1,17,1],[16,2,17,2],[16,3,17,3],[16,4,17,4],[16,6,17,6],[16,7,17,7],[16,8,17,8],[16,9,17,9],[18,8,19,8],[18,9,19,9],[20,8,21,8],[20,9,21,9],[22,8,23,8],[22,9,23,9],[24,8,25,8],[24,9,25,9],[26,8,27,8],[26,9,27,9],[28,8,29,8],[28,9,29,9],[30,8,31,8],[30,9,31,9],[32,0,32,1],[32,8,33,8],[32,9,33,9],[33,0,33,1],[34,0,34,1],[34,8,35,8],[34,9,35,9],[35,0,35,1],[36,0,36,1],[36,8,37,8],[36,9,37,9],[37,0,37,1],[38,8,39,8],[38,9,39,9],[39,0,40,0],[39,1,40,1],[39,2,40,2],[39,3,40,3],[39,4,40,4],[40,8,41,8],[40,9,41,9],[42,8,43,8],[42,9,43,9],[68,0,69,1],[89,11,89,12]]}
[{"$f":"'ACI 1'!A1","v":"QUALITY CONTROL DEPARTMENT"}]
[{"$f":"'ACI 1'!A2","v":"MES-013-07 Andersen Cascade Impactor Result Sheet for Flowrate of 60L/min"}]
[{"$f":"'ACI 1'!A3","v":"Associated Documents: TM-003"}]
[{"$f":"'ACI 1'!A4","v":"To be used with Excel 2016 only. Last Modified by P. Lillo 05-Feb-19."}]
[]
["Second Replicate Result"]
[]
["Date Tested:","{Fill in}","Flow rate, LPM:","{Fill in}","Lab Sample No.:","{Fill in}","LC-MS Sequence File Name:",null,"{Fill in}"]
["TRF No.:",{"$f":"'ACI 1'!B9","v":"{Fill in}"},"Device Type:",{"$f":"'ACI 1'!D9","v":"{Fill in}"},"Sample ID:","{Fill in}","Calibration Reference (s):",null,"{Fill in}"]
["Product Batch:",{"$f":"'ACI 1'!B10","v":"{Fill in}"},"Device IGN:",{"$f":"'ACI 1'!D10","v":"{Fill in}"},"Device ID:","{Fill in}","LC-MS Database:",null,"{Fill in}"]
["Nominal Fill Weight, mg: ",{"$f":"'ACI 1'!B11","v":"{Fill in}"},"Average DU, mg:",{"$f":"'ACI 1'!D11","v":"{Fill in}"},"Practical By:","{Fill in}","Date Reported: ",null,"{Fill in}"]
["Product Name:",{"$f":"'ACI 1'!B12","v":"{Fill in}"},"Label Claim:",{"$f":"'ACI 1'!D12","v":"{Fill in}"},null,null,"Reported By:",null,"{Fill in}"]
[]
["Description of Test Purpose (include storage conditions and/or timepoint if applicable):"]
[{"$f":"'ACI 1'!A15","v":"{Fill in}"}]
[]
["Sample","Conc (µg/mL)","Volume (mL)","Dilution\n(e.g. 1/2)","Amount per Capsule (mg)",null,"Sample ","µg/mL Injection Concentration","µg/mL Average Concentration","% Difference"]
[]
["Capsule",{"$f":"+I19","v":{"$error":"#DIV/0!"}},"{Fill in}",{"v":1,"d":"1.0"},{"$f":"IF(H19=\"{Fill in}\",\"N/A\",(B19*C19)/(D19*1000))","v":"N/A"},null,"Capsule","{Fill in}",{"$f":"AVERAGE(H19:H20)","v":{"$error":"#DIV/0!"}},{"$f":"(((MAX(H19:H20))-(MIN(H19:H20)))/I19)*100","v":{"$error":"#DIV/0!"}}]
["Inhaler",{"$f":"+I21","v":{"$error":"#DIV/0!"}},"{Fill in}",{"v":1,"d":"1.0"},{"$f":"IF(H21=\"{Fill in}\",\"N/A\",(B20*C20)/(D20*1000))","v":"N/A"},null,"Capsule","{Fill in}"]
["Adpt, Thrt, Pre-sep",{"$f":"+I23","v":{"$error":"#DIV/0!"}},"{Fill in}",{"v":1,"d":"1.0"},{"$f":"IF(H23=\"{Fill in}\",\"N/A\",(B21*C21)/(D21*1000))","v":"N/A"},null,"Inhaler","{Fill in}",{"$f":"AVERAGE(H21:H22)","v":{"$error":"#DIV/0!"}},{"$f":"(((MAX(H21:H22))-(MIN(H21:H22)))/I21)*100","v":{"$error":"#DIV/0!"}}]
["Stage -1",{"$f":"+I25","v":{"$error":"#DIV/0!"}},"{Fill in}",{"v":1,"d":"1.0"},{"$f":"IF(H25=\"{Fill in}\",\"N/A\",(B22*C22)/(D22*1000))","v":"N/A"},null,"Inhaler","{Fill in}"]
["Stage -0",{"$f":"+I27","v":{"$error":"#DIV/0!"}},"{Fill in}",{"v":1,"d":"1.0"},{"$f":"IF(H27=\"{Fill in}\",\"N/A\",(B23*C23)/(D23*1000))","v":"N/A"},null,"Adpt, Thrt, Pre-sep","{Fill in}",{"$f":"AVERAGE(H23:H24)","v":{"$error":"#DIV/0!"}},{"$f":"(((MAX(H23:H24))-(MIN(H23:H24)))/I23)*100","v":{"$error":"#DIV/0!"}}]
["Stage 1",{"$f":"+I29","v":{"$error":"#DIV/0!"}},"{Fill in}",{"v":1,"d":"1.0"},{"$f":"IF(H29=\"{Fill in}\",\"N/A\",(B24*C24)/(D24*1000))","v":"N/A"},null,"Adpt, Thrt, Pre-sep","{Fill in}"]
["Stage 2",{"$f":"+I31","v":{"$error":"#DIV/0!"}},"{Fill in}",{"v":1,"d":"1.0"},{"$f":"IF(H31=\"{Fill in}\",\"N/A\",(B25*C25)/(D25*1000))","v":"N/A"},null,"Stage -1","{Fill in}",{"$f":"AVERAGE(H25:H26)","v":{"$error":"#DIV/0!"}},{"$f":"(((MAX(H25:H26))-(MIN(H25:H26)))/I25)*100","v":{"$error":"#DIV/0!"}}]
["Stage 3",{"$f":"+I33","v":{"$error":"#DIV/0!"}},"{Fill in}",{"v":1,"d":"1.0"},{"$f":"IF(H33=\"{Fill in}\",\"N/A\",(B26*C26)/(D26*1000))","v":"N/A"},null,"Stage -1","{Fill in}"]
["Stage 4",{"$f":"+I35","v":{"$error":"#DIV/0!"}},"{Fill in}",{"v":1,"d":"1.0"},{"$f":"IF(H35=\"{Fill in}\",\"N/A\",(B27*C27)/(D27*1000))","v":"N/A"},null,"Stage -0","{Fill in}",{"$f":"AVERAGE(H27:H28)","v":{"$error":"#DIV/0!"}},{"$f":"(((MAX(H27:H28))-(MIN(H27:H28)))/I27)*100","v":{"$error":"#DIV/0!"}}]
["Stage 5",{"$f":"+I37","v":{"$error":"#DIV/0!"}},"{Fill in}",{"v":1,"d":"1.0"},{"$f":"IF(H37=\"{Fill in}\",\"N/A\",(B28*C28)/(D28*1000))","v":"N/A"},null,"Stage -0 ","{Fill in}"]
["Stage 6",{"$f":"+I39","v":{"$error":"#DIV/0!"}},"{Fill in}",{"v":1,"d":"1.0"},{"$f":"IF(H39=\"{Fill in}\",\"N/A\",(B29*C29)/(D29*1000))","v":"N/A"},null,"Stage 1","{Fill in}",{"$f":"AVERAGE(H29:H30)","v":{"$error":"#DIV/0!"}},{"$f":"(((MAX(H29:H30))-(MIN(H29:H30)))/I29)*100","v":{"$error":"#DIV/0!"}}]
["Filter",{"$f":"+I41","v":{"$error":"#DIV/0!"}},"{Fill in}",{"v":1,"d":"1.0"},{"$f":"IF(H41=\"{Fill in}\",\"N/A\",(B30*C30)/(D30*1000))","v":"N/A"},null,"Stage 1","{Fill in}"]
["Casing",{"$f":"+I43","v":{"$error":"#DIV/0!"}},"{Fill in}",{"v":1,"d":"1.0"},{"$f":"IF(H43=\"{Fill in}\",\"N/A\",(B31*C31)/(D31*1000))","v":"N/A"},null,"Stage 2","{Fill in}",{"$f":"AVERAGE(H31:H32)","v":{"$error":"#DIV/0!"}},{"$f":"(((MAX(H31:H32))-(MIN(H31:H32)))/I31)*100","v":{"$error":"#DIV/0!"}}]
[{"$nulls":6},"Stage 2","{Fill in}"]
["Fine Particle Fraction (%)",null,{"$f":"IF(D57=\"N/A\",\"N/A\",D57/C35*100)","v":"N/A"},{"$nulls":3},"Stage 3","{Fill in}",{"$f":"AVERAGE(H33:H34)","v":{"$error":"#DIV/0!"}},{"$f":"(((MAX(H33:H34))-(MIN(H33:H34)))/I33)*100","v":{"$error":"#DIV/0!"}}]
["Total Amount (mg)",null,{"$f":"IF(H19=\"{Fill in}\",\"N/A\",SUM(E19:E31))","v":"N/A"}," ",null,null,"Stage 3","{Fill in}"]
["Amount Emitted to ACI (mg)",null,{"$f":"IF(E21=\"N/A\",\"N/A\",SUM(E21:E31))","v":"N/A"},{"$nulls":3},"Stage 4","{Fill in}",{"$f":"AVERAGE(H35:H36)","v":{"$error":"#DIV/0!"}},{"$f":"(((MAX(H35:H36))-(MIN(H35:H36)))/I35)*100","v":{"$error":"#DIV/0!"}}]
["% Mass Balance of Label Claim",null,{"$f":"IF(C35=\"N/A\", \"N/A\", ((C35/D12)*100))","v":"N/A"},{"$nulls":3},"Stage 4","{Fill in}"]
["Recovery %, Fill weight",null,{"$f":"IF(H19=\"{Fill in}\",\"N/A\",100*C34/B11)","v":"N/A"},{"$nulls":3},"Stage 5","{Fill in}",{"$f":"AVERAGE(H37:H38)","v":{"$error":"#DIV/0!"}},{"$f":"(((MAX(H37:H38))-(MIN(H37:H38)))/I37)*100","v":{"$error":"#DIV/0!"}}]
[" Recovery %, DU result (75-125%)",null,{"$f":"IF(D11=\"{Fill in}\",\"N/A\", 100*C35/D11)","v":"N/A"},{"$f":"IF((ROUND(C38,0))<75,\"LOW\",(IF((ROUND(C38,0))<=125,\"COMPLIES\",\"HIGH\")))","v":{"$error":"#VALUE!"}},null,null,"Stage 5","{Fill in}"]
[{"$nulls":6},"Stage 6","{Fill in}",{"$f":"AVERAGE(H39:H40)","v":{"$error":"#DIV/0!"}},{"$f":"(((MAX(H39:H40))-(MIN(H39:H40)))/I39)*100","v":{"$error":"#DIV/0!"}}]
["Cumulative Stage","Cut off Diameter (µm)","Ln (Cut off diameter)","Cumulative Mass per Capsule (mg)","Cumulative Fraction %",null,"Stage 6","{Fill in}"]
[{"$nulls":6},"Filter","{Fill in}",{"$f":"AVERAGE(H41:H42)","v":{"$error":"#DIV/0!"}},{"$f":"(((MAX(H41:H42))-(MIN(H41:H42)))/I41)*100","v":{"$error":"#DIV/0!"}}]
["C"," ",null,{"$f":"D43+E22","v":{"$error":"#VALUE!"}},{"$f":"100*(D42/$D$42)","v":{"$error":"#VALUE!"}},null,"Filter","{Fill in}"]
["C0",8.6,{"$f":"LN(B43)","v":{"v":2.151762203259462,"d":"2.2"}},{"$error":"#VALUE!"},{"$f":"100*(D43/$D$42)","v":{"$error":"#VALUE!"}},null,"Casing","{Fill in}",{"$f":"AVERAGE(H43:H44)","v":{"$error":"#DIV/0!"}},{"$f":"(((MAX(H43:H44))-(MIN(H43:H44)))/I43)*100","v":{"$error":"#DIV/0!"}}]
["C1",6.5,{"$f":"LN(B44)","v":{"v":1.8718021769015913,"d":"1.9"}},{"$error":"#VALUE!"},{"$error":"#VALUE!"},null,"Casing","{Fill in}"]
["C2",4.4,{"v":1.4816045409242156,"d":"1.5"},{"$error":"#VALUE!"},{"$error":"#VALUE!"}]
["C3",3.2,{"v":1.1631508098056809,"d":"1.2"},{"$error":"#VALUE!"},{"$error":"#VALUE!"}]
["C4",1.9,{"v":0.6418538861723947,"d":"0.6"},{"$error":"#VALUE!"},{"$error":"#VALUE!"}]
["C5",1.2,{"v":0.1823215567939546,"d":"0.2"},{"$error":"#VALUE!"},{"$error":"#VALUE!"}]
["C6",0.55,{"v":-0.5978370007556204,"d":"-0.6"},{"$error":"#VALUE!"},{"$error":"#VALUE!"}]
["C7",0.26,{"v":-1.3470736479666092,"d":"-1.3"},{"$f":"E30","v":"N/A"},{"$error":"#VALUE!"}]
[]
["FPD (mg < 5 µm)",null,"y  =  m Ln (5) + c"]
[]
["m","c","r2"]
[{"$f":"LINEST(D44:D46,C44:C46)","v":{"$error":"#VALUE!"}},{"$error":"#VALUE!"},{"$f":"POWER((CORREL(D44:D46,C44:C46)),2)","v":{"$error":"#VALUE!"}}]
[]
["FPD per Capsule (< 5µm, mg) =",null,null,{"$f":"IF(B8=\"{Fill in}\",\"N/A\",A55*LN(5)+B55)","v":"N/A"}]
[]
["MMAD and GSD",null,"x = Exp((y - c)/m)"]
[]
["y, Cumulative %","m","c","r2","x, Diameter, µm"]
[50,{"$f":"LINEST(E44:E46,C44:C46)","v":{"$error":"#VALUE!"}},{"$error":"#VALUE!"},{"$f":"POWER((CORREL(E44:E46,C44:C46)),2)","v":{"$error":"#VALUE!"}},{"$f":"EXP((A62-C62)/B62)","v":{"$error":"#VALUE!"}}]
[15.87,{"$f":"LINEST(E46:E48,C46:C48)","v":{"$error":"#VALUE!"}},{"$error":"#VALUE!"},{"$f":"POWER((CORREL(E46:E48,C46:C48)),2)","v":{"$error":"#VALUE!"}},{"$f":"EXP((A63-C63)/B63)","v":{"$error":"#VALUE!"}}]
[84.13,{"$f":"LINEST(E43:E45,C43:C45)","v":{"$error":"#VALUE!"}},{"$error":"#VALUE!"},{"$f":"POWER((CORREL(E43:E45,C43:C45)),2)","v":{"$error":"#VALUE!"}},{"$f":"EXP((A64-C64)/B64)","v":{"$error":"#VALUE!"}}]
[]
["MMAD, µm :",{"$f":"IF(B8=\"{Fill in}\",\"N/A\",E62)","v":"N/A"}]
["GSD :",{"$f":"IF(B8=\"{Fill in}\",\"N/A\",SQRT(E64/E63))","v":"N/A"}]
[]
["Mannitol Recovered from Stage Groupings (mg)"]
[]
["ATP to Stage -0",{"$f":"IF(B11=40,IF(E21=\"N/A\",\"N/A\",(IF(E22=\"N/A\",\"N/A\",(IF(E23=\"N/A\",\"N/A\",SUM(E21:E23)))))),\"N/A\")","v":"N/A"}]
["Stages 1 to 3",{"$f":"IF(B11=40,IF(E24=\"N/A\",\"N/A\",(IF(E25=\"N/A\",\"N/A\",(IF(E26=\"N/A\",\"N/A\",SUM(E24:E26)))))),\"N/A\")","v":"N/A"}]
["Stages 4 to 6",{"$f":"IF(B11=40,IF(E27=\"N/A\",\"N/A\",(IF(E28=\"N/A\",\"N/A\",(IF(E29=\"N/A\",\"N/A\",SUM(E27:E29)))))),\"N/A\")","v":"N/A"}]
["Filter",{"$f":"IF(B11=40, E30, \"N/A\")","v":"N/A"}]
[]
[]
["Reported By:"]
["(Sign & Date)"]

{"sheet":"ACI 3","index":2,"n_rows":78,"n_cols":10,"rows_kept":78,"merged":[[16,0,17,0],[16,1,17,1],[16,2,17,2],[16,3,17,3],[16,4,17,4],[16,6,17,6],[16,7,17,7],[16,8,17,8],[16,9,17,9],[18,8,19,8],[18,9,19,9],[20,8,21,8],[20,9,21,9],[22,8,23,8],[22,9,23,9],[24,8,25,8],[24,9,25,9],[26,8,27,8],[26,9,27,9],[28,8,29,8],[28,9,29,9],[30,8,31,8],[30,9,31,9],[32,0,32,1],[32,8,33,8],[32,9,33,9],[33,0,33,1],[34,0,34,1],[34,8,35,8],[34,9,35,9],[35,0,35,1],[36,0,36,1],[36,8,37,8],[36,9,37,9],[37,0,37,1],[38,8,39,8],[38,9,39,9],[39,0,40,0],[39,1,40,1],[39,2,40,2],[39,3,40,3],[39,4,40,4],[40,8,41,8],[40,9,41,9],[42,8,43,8],[42,9,43,9],[68,0,69,1],[91,13,91,14]]}
[{"$f":"'ACI 1'!A1","v":"QUALITY CONTROL DEPARTMENT"}]
[{"$f":"'ACI 1'!A2","v":"MES-013-07 Andersen Cascade Impactor Result Sheet for Flowrate of 60L/min"}]
[{"$f":"'ACI 1'!A3","v":"Associated Documents: TM-003"}]
[{"$f":"'ACI 1'!A4","v":"To be used with Excel 2016 only. Last Modified by P. Lillo 05-Feb-19."}]
[]
["Third Replicate Result"]
[]
["Date Tested:","{Fill in}","Flow rate, LPM:","{Fill in}","Lab Sample No.:","{Fill in}","LC-MS Sequence File Name:",null,"{Fill in}"]
["TRF No.:",{"$f":"'ACI 1'!B9","v":"{Fill in}"},"Device Type:",{"$f":"'ACI 1'!D9","v":"{Fill in}"},"Sample ID:","{Fill in}","Calibration Reference (s):",null,"{Fill in}"]
["Product Batch:",{"$f":"'ACI 1'!B10","v":"{Fill in}"},"Device IGN:",{"$f":"'ACI 1'!D10","v":"{Fill in}"},"Device ID:","{Fill in}","LC-MS Database:",null,"{Fill in}"]
["Nominal Fill Weight, mg: ",{"$f":"'ACI 1'!B11","v":"{Fill in}"},"Average DU, mg:",{"$f":"'ACI 1'!D11","v":"{Fill in}"},"Practical By:","{Fill in}","Date Reported: ",null,"{Fill in}"]
["Product Name:",{"$f":"'ACI 1'!B12","v":"{Fill in}"},"Label Claim:",{"$f":"'ACI 1'!D12","v":"{Fill in}"},null,null,"Reported By:",null,"{Fill in}"]
[]
["Description of Test Purpose (include storage conditions and/or timepoint if applicable):"]
[{"$f":"'ACI 1'!A15","v":"{Fill in}"}]
[]
["Sample","Conc (µg/mL)","Volume (mL)","Dilution\n(e.g. 1/2)","Amount per Capsule (mg)",null,"Sample ","µg/mL Injection Concentration","µg/mL Average Concentration","% Difference"]
[]
["Capsule",{"$f":"+I19","v":{"$error":"#DIV/0!"}},"{Fill in}",{"v":1,"d":"1.0"},{"$f":"IF(H19=\"{Fill in}\",\"N/A\",(B19*C19)/(D19*1000))","v":"N/A"},null,"Capsule","{Fill in}",{"$f":"AVERAGE(H19:H20)","v":{"$error":"#DIV/0!"}},{"$f":"(((MAX(H19:H20))-(MIN(H19:H20)))/I19)*100","v":{"$error":"#DIV/0!"}}]
["Inhaler",{"$f":"+I21","v":{"$error":"#DIV/0!"}},"{Fill in}",{"v":1,"d":"1.0"},{"$f":"IF(H21=\"{Fill in}\",\"N/A\",(B20*C20)/(D20*1000))","v":"N/A"},null,"Capsule","{Fill in}"]
["Adpt, Thrt, Pre-sep",{"$f":"+I23","v":{"$error":"#DIV/0!"}},"{Fill in}",{"v":1,"d":"1.0"},{"$f":"IF(H23=\"{Fill in}\",\"N/A\",(B21*C21)/(D21*1000))","v":"N/A"},null,"Inhaler","{Fill in}",{"$f":"AVERAGE(H21:H22)","v":{"$error":"#DIV/0!"}},{"$f":"(((MAX(H21:H22))-(MIN(H21:H22)))/I21)*100","v":{"$error":"#DIV/0!"}}]
["Stage -1",{"$f":"+I25","v":{"$error":"#DIV/0!"}},"{Fill in}",{"v":1,"d":"1.0"},{"$f":"IF(H25=\"{Fill in}\",\"N/A\",(B22*C22)/(D22*1000))","v":"N/A"},null,"Inhaler","{Fill in}"]
["Stage -0",{"$f":"+I27","v":{"$error":"#DIV/0!"}},"{Fill in}",{"v":1,"d":"1.0"},{"$f":"IF(H27=\"{Fill in}\",\"N/A\",(B23*C23)/(D23*1000))","v":"N/A"},null,"Adpt, Thrt, Pre-sep","{Fill in}",{"$f":"AVERAGE(H23:H24)","v":{"$error":"#DIV/0!"}},{"$f":"(((MAX(H23:H24))-(MIN(H23:H24)))/I23)*100","v":{"$error":"#DIV/0!"}}]
["Stage 1",{"$f":"+I29","v":{"$error":"#DIV/0!"}},"{Fill in}",{"v":1,"d":"1.0"},{"$f":"IF(H29=\"{Fill in}\",\"N/A\",(B24*C24)/(D24*1000))","v":"N/A"},null,"Adpt, Thrt, Pre-sep","{Fill in}"]
["Stage 2",{"$f":"+I31","v":{"$error":"#DIV/0!"}},"{Fill in}",{"v":1,"d":"1.0"},{"$f":"IF(H31=\"{Fill in}\",\"N/A\",(B25*C25)/(D25*1000))","v":"N/A"},null,"Stage -1","{Fill in}",{"$f":"AVERAGE(H25:H26)","v":{"$error":"#DIV/0!"}},{"$f":"(((MAX(H25:H26))-(MIN(H25:H26)))/I25)*100","v":{"$error":"#DIV/0!"}}]
["Stage 3",{"$f":"+I33","v":{"$error":"#DIV/0!"}},"{Fill in}",{"v":1,"d":"1.0"},{"$f":"IF(H33=\"{Fill in}\",\"N/A\",(B26*C26)/(D26*1000))","v":"N/A"},null,"Stage -1","{Fill in}"]
["Stage 4",{"$f":"+I35","v":{"$error":"#DIV/0!"}},"{Fill in}",{"v":1,"d":"1.0"},{"$f":"IF(H35=\"{Fill in}\",\"N/A\",(B27*C27)/(D27*1000))","v":"N/A"},null,"Stage -0","{Fill in}",{"$f":"AVERAGE(H27:H28)","v":{"$error":"#DIV/0!"}},{"$f":"(((MAX(H27:H28))-(MIN(H27:H28)))/I27)*100","v":{"$error":"#DIV/0!"}}]
["Stage 5",{"$f":"+I37","v":{"$error":"#DIV/0!"}},"{Fill in}",{"v":1,"d":"1.0"},{"$f":"IF(H37=\"{Fill in}\",\"N/A\",(B28*C28)/(D28*1000))","v":"N/A"},null,"Stage -0 ","{Fill in}"]
["Stage 6",{"$f":"+I39","v":{"$error":"#DIV/0!"}},"{Fill in}",{"v":1,"d":"1.0"},{"$f":"IF(H39=\"{Fill in}\",\"N/A\",(B29*C29)/(D29*1000))","v":"N/A"},null,"Stage 1","{Fill in}",{"$f":"AVERAGE(H29:H30)","v":{"$error":"#DIV/0!"}},{"$f":"(((MAX(H29:H30))-(MIN(H29:H30)))/I29)*100","v":{"$error":"#DIV/0!"}}]
["Filter",{"$f":"+I41","v":{"$error":"#DIV/0!"}},"{Fill in}",{"v":1,"d":"1.0"},{"$f":"IF(H41=\"{Fill in}\",\"N/A\",(B30*C30)/(D30*1000))","v":"N/A"},null,"Stage 1","{Fill in}"]
["Casing",{"$f":"+I43","v":{"$error":"#DIV/0!"}},"{Fill in}",{"v":1,"d":"1.0"},{"$f":"IF(H43=\"{Fill in}\",\"N/A\",(B31*C31)/(D31*1000))","v":"N/A"},null,"Stage 2","{Fill in}",{"$f":"AVERAGE(H31:H32)","v":{"$error":"#DIV/0!"}},{"$f":"(((MAX(H31:H32))-(MIN(H31:H32)))/I31)*100","v":{"$error":"#DIV/0!"}}]
[{"$nulls":6},"Stage 2","{Fill in}"]
["Fine Particle Fraction (%)",null,{"$f":"IF(D57=\"N/A\",\"N/A\",D57/C35*100)","v":"N/A"},{"$nulls":3},"Stage 3","{Fill in}",{"$f":"AVERAGE(H33:H34)","v":{"$error":"#DIV/0!"}},{"$f":"(((MAX(H33:H34))-(MIN(H33:H34)))/I33)*100","v":{"$error":"#DIV/0!"}}]
["Total Amount (mg)",null,{"$f":"IF(H19=\"{Fill in}\",\"N/A\",SUM(E19:E31))","v":"N/A"}," ",null,null,"Stage 3","{Fill in}"]
["Amount Emitted to ACI (mg)",null,{"$f":"IF(E21=\"N/A\",\"N/A\",SUM(E21:E31))","v":"N/A"},{"$nulls":3},"Stage 4","{Fill in}",{"$f":"AVERAGE(H35:H36)","v":{"$error":"#DIV/0!"}},{"$f":"(((MAX(H35:H36))-(MIN(H35:H36)))/I35)*100","v":{"$error":"#DIV/0!"}}]
["% Mass Balance of Label Claim",null,{"$f":"IF(C35=\"N/A\", \"N/A\", ((C35/D12)*100))","v":"N/A"},{"$nulls":3},"Stage 4","{Fill in}"]
["Recovery %, Fill weight",null,{"$f":"IF(H19=\"{Fill in}\",\"N/A\",100*C34/B11)","v":"N/A"},{"$nulls":3},"Stage 5","{Fill in}",{"$f":"AVERAGE(H37:H38)","v":{"$error":"#DIV/0!"}},{"$f":"(((MAX(H37:H38))-(MIN(H37:H38)))/I37)*100","v":{"$error":"#DIV/0!"}}]
[" Recovery %, DU result (75-125%)",null,{"$f":"IF(D11=\"{Fill in}\",\"N/A\",100*C35/D11)","v":"N/A"},{"$f":"IF((ROUND(C38,0))<75,\"LOW\",(IF((ROUND(C38,0))<=125,\"COMPLIES\",\"HIGH\")))","v":{"$error":"#VALUE!"}},null,null,"Stage 5","{Fill in}"]
[{"$nulls":6},"Stage 6","{Fill in}",{"$f":"AVERAGE(H39:H40)","v":{"$error":"#DIV/0!"}},{"$f":"(((MAX(H39:H40))-(MIN(H39:H40)))/I39)*100","v":{"$error":"#DIV/0!"}}]
["Cumulative Stage","Cut off Diameter (µm)","Ln (Cut off diameter)","Cumulative Mass per Capsule (mg)","Cumulative Fraction %",null,"Stage 6","{Fill in}"]
[{"$nulls":6},"Filter","{Fill in}",{"$f":"AVERAGE(H41:H42)","v":{"$error":"#DIV/0!"}},{"$f":"(((MAX(H41:H42))-(MIN(H41:H42)))/I41)*100","v":{"$error":"#DIV/0!"}}]
["C"," ",null,{"$f":"D43+E22","v":{"$error":"#VALUE!"}},{"$f":"100*(D42/$D$42)","v":{"$error":"#VALUE!"}},null,"Filter","{Fill in}"]
["C0",8.6,{"$f":"LN(B43)","v":{"v":2.151762203259462,"d":"2.2"}},{"$error":"#VALUE!"},{"$f":"100*(D43/$D$42)","v":{"$error":"#VALUE!"}},null,"Casing","{Fill in}",{"$f":"AVERAGE(H43:H44)","v":{"$error":"#DIV/0!"}},{"$f":"(((MAX(H43:H44))-(MIN(H43:H44)))/I43)*100","v":{"$error":"#DIV/0!"}}]
["C1",6.5,{"$f":"LN(B44)","v":{"v":1.8718021769015913,"d":"1.9"}},{"$error":"#VALUE!"},{"$error":"#VALUE!"},null,"Casing","{Fill in}"]
["C2",4.4,{"v":1.4816045409242156,"d":"1.5"},{"$error":"#VALUE!"},{"$error":"#VALUE!"}]
["C3",3.2,{"v":1.1631508098056809,"d":"1.2"},{"$error":"#VALUE!"},{"$error":"#VALUE!"}]
["C4",1.9,{"v":0.6418538861723947,"d":"0.6"},{"$error":"#VALUE!"},{"$error":"#VALUE!"}]
["C5",1.2,{"v":0.1823215567939546,"d":"0.2"},{"$error":"#VALUE!"},{"$error":"#VALUE!"}]
["C6",0.55,{"v":-0.5978370007556204,"d":"-0.6"},{"$error":"#VALUE!"},{"$error":"#VALUE!"}]
["C7",0.26,{"v":-1.3470736479666092,"d":"-1.3"},{"$f":"E30","v":"N/A"},{"$error":"#VALUE!"}]
[]
["FPD (mg < 5 µm)",null,"y  =  m Ln (5) + c"]
[]
["m","c","r2"]
[{"$f":"LINEST(D44:D46,C44:C46)","v":{"$error":"#VALUE!"}},{"$error":"#VALUE!"},{"$f":"POWER((CORREL(D44:D46,C44:C46)),2)","v":{"$error":"#VALUE!"}}]
[]
["FPD per Capsule (< 5µm, mg) =",null,null,{"$f":"IF(B8=\"{Fill in}\",\"N/A\",A55*LN(5)+B55)","v":"N/A"}]
[]
["MMAD and GSD",null,"x = Exp((y - c)/m)"]
[]
["y, Cumulative %","m","c","r2","x, Diameter, µm"]
[50,{"$f":"LINEST(E44:E46,C44:C46)","v":{"$error":"#VALUE!"}},{"$error":"#VALUE!"},{"$f":"POWER((CORREL(E44:E46,C44:C46)),2)","v":{"$error":"#VALUE!"}},{"$f":"EXP((A62-C62)/B62)","v":{"$error":"#VALUE!"}}]
[15.87,{"$f":"LINEST(E46:E48,C46:C48)","v":{"$error":"#VALUE!"}},{"$error":"#VALUE!"},{"$f":"POWER((CORREL(E46:E48,C46:C48)),2)","v":{"$error":"#VALUE!"}},{"$f":"EXP((A63-C63)/B63)","v":{"$error":"#VALUE!"}}]
[84.13,{"$f":"LINEST(E43:E45,C43:C45)","v":{"$error":"#VALUE!"}},{"$error":"#VALUE!"},{"$f":"POWER((CORREL(E43:E45,C43:C45)),2)","v":{"$error":"#VALUE!"}},{"$f":"EXP((A64-C64)/B64)","v":{"$error":"#VALUE!"}}]
[]
["MMAD, µm :",{"$f":"IF(B8=\"{Fill in}\",\"N/A\",E62)","v":"N/A"}]
["GSD :",{"$f":"IF(B8=\"{Fill in}\",\"N/A\",SQRT(E64/E63))","v":"N/A"}]
[]
["Mannitol Recovered from Stage Groupings (mg)"]
[]
["ATP to Stage -0",{"$f":"IF(B11=40,IF(E21=\"N/A\",\"N/A\",(IF(E22=\"N/A\",\"N/A\",(IF(E23=\"N/A\",\"N/A\",SUM(E21:E23)))))),\"N/A\")","v":"N/A"}]
["Stages 1 to 3",{"$f":"IF(B11=40,IF(E24=\"N/A\",\"N/A\",(IF(E25=\"N/A\",\"N/A\",(IF(E26=\"N/A\",\"N/A\",SUM(E24:E26)))))),\"N/A\")","v":"N/A"}]
["Stages 4 to 6",{"$f":"IF(B11=40,IF(E27=\"N/A\",\"N/A\",(IF(E28=\"N/A\",\"N/A\",(IF(E29=\"N/A\",\"N/A\",SUM(E27:E29)))))),\"N/A\")","v":"N/A"}]
["Filter",{"$f":"IF(B11=40, E30, \"N/A\")","v":"N/A"}]
[]
[]
["Reported By:"]
["(Sign & Date)"]

{"sheet":"ACI 4","index":3,"n_rows":78,"n_cols":10,"rows_kept":78,"merged":[[16,0,17,0],[16,1,17,1],[16,2,17,2],[16,3,17,3],[16,4,17,4],[16,6,17,6],[16,7,17,7],[16,8,17,8],[16,9,17,9],[18,8,19,8],[18,9,19,9],[20,8,21,8],[20,9,21,9],[22,8,23,8],[22,9,23,9],[24,8,25,8],[24,9,25,9],[26,8,27,8],[26,9,27,9],[28,8,29,8],[28,9,29,9],[30,8,31,8],[30,9,31,9],[32,0,32,1],[32,8,33,8],[32,9,33,9],[33,0,33,1],[34,0,34,1],[34,8,35,8],[34,9,35,9],[35,0,35,1],[36,0,36,1],[36,8,37,8],[36,9,37,9],[37,0,37,1],[38,8,39,8],[38,9,39,9],[39,0,40,0],[39,1,40,1],[39,2,40,2],[39,3,40,3],[39,4,40,4],[40,8,41,8],[40,9,41,9],[42,8,43,8],[42,9,43,9],[68,0,69,1],[90,13,90,14]]}
[{"$f":"'ACI 1'!A1","v":"QUALITY CONTROL DEPARTMENT"}]
[{"$f":"'ACI 1'!A2","v":"MES-013-07 Andersen Cascade Impactor Result Sheet for Flowrate of 60L/min"}]
[{"$f":"'ACI 1'!A3","v":"Associated Documents: TM-003"}]
[{"$f":"'ACI 1'!A4","v":"To be used with Excel 2016 only. Last Modified by P. Lillo 05-Feb-19."}]
[]
["Fourth Replicate Result"]
[]
["Date Tested:","{Fill in}","Flow rate, LPM:","{Fill in}","Lab Sample No.:","{Fill in}","LC-MS Sequence File Name:",null,"{Fill in}"]
["TRF No.:",{"$f":"'ACI 1'!B9","v":"{Fill in}"},"Device Type:",{"$f":"'ACI 1'!D9","v":"{Fill in}"},"Sample ID:","{Fill in}","Calibration Reference (s):",null,"{Fill in}"]
["Product Batch:",{"$f":"'ACI 1'!B10","v":"{Fill in}"},"Device IGN:",{"$f":"'ACI 1'!D10","v":"{Fill in}"},"Device ID:","{Fill in}","LC-MS Database:",null,"{Fill in}"]
["Nominal Fill Weight, mg: ",{"$f":"'ACI 1'!B11","v":"{Fill in}"},"Average DU, mg:",{"$f":"'ACI 1'!D11","v":"{Fill in}"},"Practical By:","{Fill in}","Date Reported: ",null,"{Fill in}"]
["Product Name:",{"$f":"'ACI 1'!B12","v":"{Fill in}"},"Label Claim:",{"$f":"'ACI 1'!D12","v":"{Fill in}"},null,null,"Reported By:",null,"{Fill in}"]
[]
["Description of Test Purpose (include storage conditions and/or timepoint if applicable):"]
[{"$f":"'ACI 1'!A15","v":"{Fill in}"}]
[]
["Sample","Conc (µg/mL)","Volume (mL)","Dilution\n(e.g. 1/2)","Amount per Capsule (mg)",null,"Sample ","µg/mL Injection Concentration","µg/mL Average Concentration","% Difference"]
[]
["Capsule",{"$f":"+I19","v":{"$error":"#DIV/0!"}},"{Fill in}",{"v":1,"d":"1.0"},{"$f":"IF(H19=\"{Fill in}\",\"N/A\",(B19*C19)/(D19*1000))","v":"N/A"},null,"Capsule","{Fill in}",{"$f":"AVERAGE(H19:H20)","v":{"$error":"#DIV/0!"}},{"$f":"(((MAX(H19:H20))-(MIN(H19:H20)))/I19)*100","v":{"$error":"#DIV/0!"}}]
["Inhaler",{"$f":"+I21","v":{"$error":"#DIV/0!"}},"{Fill in}",{"v":1,"d":"1.0"},{"$f":"IF(H21=\"{Fill in}\",\"N/A\",(B20*C20)/(D20*1000))","v":"N/A"},null,"Capsule","{Fill in}"]
["Adpt, Thrt, Pre-sep",{"$f":"+I23","v":{"$error":"#DIV/0!"}},"{Fill in}",{"v":1,"d":"1.0"},{"$f":"IF(H23=\"{Fill in}\",\"N/A\",(B21*C21)/(D21*1000))","v":"N/A"},null,"Inhaler","{Fill in}",{"$f":"AVERAGE(H21:H22)","v":{"$error":"#DIV/0!"}},{"$f":"(((MAX(H21:H22))-(MIN(H21:H22)))/I21)*100","v":{"$error":"#DIV/0!"}}]
["Stage -1",{"$f":"+I25","v":{"$error":"#DIV/0!"}},"{Fill in}",{"v":1,"d":"1.0"},{"$f":"IF(H25=\"{Fill in}\",\"N/A\",(B22*C22)/(D22*1000))","v":"N/A"},null,"Inhaler","{Fill in}"]
["Stage -0",{"$f":"+I27","v":{"$error":"#DIV/0!"}},"{Fill in}",{"v":1,"d":"1.0"},{"$f":"IF(H27=\"{Fill in}\",\"N/A\",(B23*C23)/(D23*1000))","v":"N/A"},null,"Adpt, Thrt, Pre-sep","{Fill in}",{"$f":"AVERAGE(H23:H24)","v":{"$error":"#DIV/0!"}},{"$f":"(((MAX(H23:H24))-(MIN(H23:H24)))/I23)*100","v":{"$error":"#DIV/0!"}}]
["Stage 1",{"$f":"+I29","v":{"$error":"#DIV/0!"}},"{Fill in}",{"v":1,"d":"1.0"},{"$f":"IF(H29=\"{Fill in}\",\"N/A\",(B24*C24)/(D24*1000))","v":"N/A"},null,"Adpt, Thrt, Pre-sep","{Fill in}"]
["Stage 2",{"$f":"+I31","v":{"$error":"#DIV/0!"}},"{Fill in}",{"v":1,"d":"1.0"},{"$f":"IF(H31=\"{Fill in}\",\"N/A\",(B25*C25)/(D25*1000))","v":"N/A"},null,"Stage -1","{Fill in}",{"$f":"AVERAGE(H25:H26)","v":{"$error":"#DIV/0!"}},{"$f":"(((MAX(H25:H26))-(MIN(H25:H26)))/I25)*100","v":{"$error":"#DIV/0!"}}]
["Stage 3",{"$f":"+I33","v":{"$error":"#DIV/0!"}},"{Fill in}",{"v":1,"d":"1.0"},{"$f":"IF(H33=\"{Fill in}\",\"N/A\",(B26*C26)/(D26*1000))","v":"N/A"},null,"Stage -1","{Fill in}"]
["Stage 4",{"$f":"+I35","v":{"$error":"#DIV/0!"}},"{Fill in}",{"v":1,"d":"1.0"},{"$f":"IF(H35=\"{Fill in}\",\"N/A\",(B27*C27)/(D27*1000))","v":"N/A"},null,"Stage -0","{Fill in}",{"$f":"AVERAGE(H27:H28)","v":{"$error":"#DIV/0!"}},{"$f":"(((MAX(H27:H28))-(MIN(H27:H28)))/I27)*100","v":{"$error":"#DIV/0!"}}]
["Stage 5",{"$f":"+I37","v":{"$error":"#DIV/0!"}},"{Fill in}",{"v":1,"d":"1.0"},{"$f":"IF(H37=\"{Fill in}\",\"N/A\",(B28*C28)/(D28*1000))","v":"N/A"},null,"Stage -0 ","{Fill in}"]
["Stage 6",{"$f":"+I39","v":{"$error":"#DIV/0!"}},"{Fill in}",{"v":1,"d":"1.0"},{"$f":"IF(H39=\"{Fill in}\",\"N/A\",(B29*C29)/(D29*1000))","v":"N/A"},null,"Stage 1","{Fill in}",{"$f":"AVERAGE(H29:H30)","v":{"$error":"#DIV/0!"}},{"$f":"(((MAX(H29:H30))-(MIN(H29:H30)))/I29)*100","v":{"$error":"#DIV/0!"}}]
["Filter",{"$f":"+I41","v":{"$error":"#DIV/0!"}},"{Fill in}",{"v":1,"d":"1.0"},{"$f":"IF(H41=\"{Fill in}\",\"N/A\",(B30*C30)/(D30*1000))","v":"N/A"},null,"Stage 1","{Fill in}"]
["Casing",{"$f":"+I43","v":{"$error":"#DIV/0!"}},"{Fill in}",{"v":1,"d":"1.0"},{"$f":"IF(H43=\"{Fill in}\",\"N/A\",(B31*C31)/(D31*1000))","v":"N/A"},null,"Stage 2","{Fill in}",{"$f":"AVERAGE(H31:H32)","v":{"$error":"#DIV/0!"}},{"$f":"(((MAX(H31:H32))-(MIN(H31:H32)))/I31)*100","v":{"$error":"#DIV/0!"}}]
[{"$nulls":6},"Stage 2","{Fill in}"]
["Fine Particle Fraction (%)",null,{"$f":"IF(D57=\"N/A\",\"N/A\",D57/C35*100)","v":"N/A"},{"$nulls":3},"Stage 3","{Fill in}",{"$f":"AVERAGE(H33:H34)","v":{"$error":"#DIV/0!"}},{"$f":"(((MAX(H33:H34))-(MIN(H33:H34)))/I33)*100","v":{"$error":"#DIV/0!"}}]
["Total Amount (mg)",null,{"$f":"IF(H19=\"{Fill in}\",\"N/A\",SUM(E19:E31))","v":"N/A"}," ",null,null,"Stage 3","{Fill in}"]
["Amount Emitted to ACI (mg)",null,{"$f":"IF(E21=\"N/A\",\"N/A\",SUM(E21:E31))","v":"N/A"},{"$nulls":3},"Stage 4","{Fill in}",{"$f":"AVERAGE(H35:H36)","v":{"$error":"#DIV/0!"}},{"$f":"(((MAX(H35:H36))-(MIN(H35:H36)))/I35)*100","v":{"$error":"#DIV/0!"}}]
["% Mass Balance of Label Claim",null,{"$f":"IF(C35=\"N/A\", \"N/A\", ((C35/D12)*100))","v":"N/A"},{"$nulls":3},"Stage 4","{Fill in}"]
["Recovery %, Fill weight",null,{"$f":"IF(H19=\"{Fill in}\",\"N/A\",100*C34/B11)","v":"N/A"},{"$nulls":3},"Stage 5","{Fill in}",{"$f":"AVERAGE(H37:H38)","v":{"$error":"#DIV/0!"}},{"$f":"(((MAX(H37:H38))-(MIN(H37:H38)))/I37)*100","v":{"$error":"#DIV/0!"}}]
[" Recovery %, DU result (75-125%)",null,{"$f":"IF(D11=\"{Fill in}\",\"N/A\",100*C35/D11)","v":"N/A"},{"$f":"IF((ROUND(C38,0))<75,\"LOW\",(IF((ROUND(C38,0))<=125,\"COMPLIES\",\"HIGH\")))","v":{"$error":"#VALUE!"}},null,null,"Stage 5","{Fill in}"]
[{"$nulls":6},"Stage 6","{Fill in}",{"$f":"AVERAGE(H39:H40)","v":{"$error":"#DIV/0!"}},{"$f":"(((MAX(H39:H40))-(MIN(H39:H40)))/I39)*100","v":{"$error":"#DIV/0!"}}]
["Cumulative Stage","Cut off Diameter (µm)","Ln (Cut off diameter)","Cumulative Mass per Capsule (mg)","Cumulative Fraction %",null,"Stage 6","{Fill in}"]
[{"$nulls":6},"Filter","{Fill in}",{"$f":"AVERAGE(H41:H42)","v":{"$error":"#DIV/0!"}},{"$f":"(((MAX(H41:H42))-(MIN(H41:H42)))/I41)*100","v":{"$error":"#DIV/0!"}}]
["C"," ",null,{"$f":"D43+E22","v":{"$error":"#VALUE!"}},{"$f":"100*(D42/$D$42)","v":{"$error":"#VALUE!"}},null,"Filter","{Fill in}"]
["C0",8.6,{"$f":"LN(B43)","v":{"v":2.151762203259462,"d":"2.2"}},{"$error":"#VALUE!"},{"$f":"100*(D43/$D$42)","v":{"$error":"#VALUE!"}},null,"Casing","{Fill in}",{"$f":"AVERAGE(H43:H44)","v":{"$error":"#DIV/0!"}},{"$f":"(((MAX(H43:H44))-(MIN(H43:H44)))/I43)*100","v":{"$error":"#DIV/0!"}}]
["C1",6.5,{"$f":"LN(B44)","v":{"v":1.8718021769015913,"d":"1.9"}},{"$error":"#VALUE!"},{"$error":"#VALUE!"},null,"Casing","{Fill in}"]
["C2",4.4,{"v":1.4816045409242156,"d":"1.5"},{"$error":"#VALUE!"},{"$error":"#VALUE!"}]
["C3",3.2,{"v":1.1631508098056809,"d":"1.2"},{"$error":"#VALUE!"},{"$error":"#VALUE!"}]
["C4",1.9,{"v":0.6418538861723947,"d":"0.6"},{"$error":"#VALUE!"},{"$error":"#VALUE!"}]
["C5",1.2,{"v":0.1823215567939546,"d":"0.2"},{"$error":"#VALUE!"},{"$error":"#VALUE!"}]
["C6",0.55,{"v":-0.5978370007556204,"d":"-0.6"},{"$error":"#VALUE!"},{"$error":"#VALUE!"}]
["C7",0.26,{"v":-1.3470736479666092,"d":"-1.3"},{"$f":"E30","v":"N/A"},{"$error":"#VALUE!"}]
[]
["FPD (mg < 5 µm)",null,"y  =  m Ln (5) + c"]
[]
["m","c","r2"]
[{"$f":"LINEST(D44:D46,C44:C46)","v":{"$error":"#VALUE!"}},{"$error":"#VALUE!"},{"$f":"POWER((CORREL(D44:D46,C44:C46)),2)","v":{"$error":"#VALUE!"}}]
[]
["FPD per Capsule (< 5µm, mg) =",null,null,{"$f":"IF(B8=\"{Fill in}\",\"N/A\",A55*LN(5)+B55)","v":"N/A"}]
[]
["MMAD and GSD",null,"x = Exp((y - c)/m)"]
[]
["y, Cumulative %","m","c","r2","x, Diameter, µm"]
[50,{"$f":"LINEST(E44:E46,C44:C46)","v":{"$error":"#VALUE!"}},{"$error":"#VALUE!"},{"$f":"POWER((CORREL(E44:E46,C44:C46)),2)","v":{"$error":"#VALUE!"}},{"$f":"EXP((A62-C62)/B62)","v":{"$error":"#VALUE!"}}]
[15.87,{"$f":"LINEST(E46:E48,C46:C48)","v":{"$error":"#VALUE!"}},{"$error":"#VALUE!"},{"$f":"POWER((CORREL(E46:E48,C46:C48)),2)","v":{"$error":"#VALUE!"}},{"$f":"EXP((A63-C63)/B63)","v":{"$error":"#VALUE!"}}]
[84.13,{"$f":"LINEST(E43:E45,C43:C45)","v":{"$error":"#VALUE!"}},{"$error":"#VALUE!"},{"$f":"POWER((CORREL(E43:E45,C43:C45)),2)","v":{"$error":"#VALUE!"}},{"$f":"EXP((A64-C64)/B64)","v":{"$error":"#VALUE!"}}]
[]
["MMAD, µm :",{"$f":"IF(B8=\"{Fill in}\",\"N/A\",E62)","v":"N/A"}]
["GSD :",{"$f":"IF(B8=\"{Fill in}\",\"N/A\",SQRT(E64/E63))","v":"N/A"}]
[]
["Mannitol Recovered from Stage Groupings (mg)"]
[]
["ATP to Stage -0",{"$f":"IF(B11=40,IF(E21=\"N/A\",\"N/A\",(IF(E22=\"N/A\",\"N/A\",(IF(E23=\"N/A\",\"N/A\",SUM(E21:E23)))))),\"N/A\")","v":"N/A"}]
["Stages 1 to 3",{"$f":"IF(B11=40,IF(E24=\"N/A\",\"N/A\",(IF(E25=\"N/A\",\"N/A\",(IF(E26=\"N/A\",\"N/A\",SUM(E24:E26)))))),\"N/A\")","v":"N/A"}]
["Stages 4 to 6",{"$f":"IF(B11=40,IF(E27=\"N/A\",\"N/A\",(IF(E28=\"N/A\",\"N/A\",(IF(E29=\"N/A\",\"N/A\",SUM(E27:E29)))))),\"N/A\")","v":"N/A"}]
["Filter",{"$f":"IF(B11=40, E30, \"N/A\")","v":"N/A"}]
[]
[]
["Reported By:"]
["(Sign & Date)"]

{"sheet":"ACI 5","index":4,"n_rows":78,"n_cols":10,"rows_kept":78,"merged":[[16,0,17,0],[16,1,17,1],[16,2,17,2],[16,3,17,3],[16,4,17,4],[16,6,17,6],[16,7,17,7],[16,8,17,8],[16,9,17,9],[18,8,19,8],[18,9,19,9],[20,8,21,8],[20,9,21,9],[22,8,23,8],[22,9,23,9],[24,8,25,8],[24,9,25,9],[26,8,27,8],[26,9,27,9],[28,8,29,8],[28,9,29,9],[30,8,31,8],[30,9,31,9],[32,0,32,1],[32,8,33,8],[32,9,33,9],[33,0,33,1],[34,0,34,1],[34,8,35,8],[34,9,35,9],[35,0,35,1],[36,0,36,1],[36,8,37,8],[36,9,37,9],[37,0,37,1],[38,8,39,8],[38,9,39,9],[39,0,40,0],[39,1,40,1],[39,2,40,2],[39,3,40,3],[39,4,40,4],[40,8,41,8],[40,9,41,9],[42,8,43,8],[42,9,43,9],[68,0,69,1],[89,11,89,12]]}
[{"$f":"'ACI 1'!A1","v":"QUALITY CONTROL DEPARTMENT"}]
[{"$f":"'ACI 1'!A2","v":"MES-013-07 Andersen Cascade Impactor Result Sheet for Flowrate of 60L/min"}]
[{"$f":"'ACI 1'!A3","v":"Associated Documents: TM-003"}]
[{"$f":"'ACI 1'!A4","v":"To be used with Excel 2016 only. Last Modified by P. Lillo 05-Feb-19."}]
[]
["Fifth Replicate Result"]
[]
["Date Tested:","{Fill in}","Flow rate, LPM:","{Fill in}","Lab Sample No.:","{Fill in}","LC-MS Sequence File Name:",null,"{Fill in}"]
["TRF No.:",{"$f":"'ACI 1'!B9","v":"{Fill in}"},"Device Type:",{"$f":"'ACI 1'!D9","v":"{Fill in}"},"Sample ID:","{Fill in}","Calibration Reference (s):",null,"{Fill in}"]
["Product Batch:",{"$f":"'ACI 1'!B10","v":"{Fill in}"},"Device IGN:",{"$f":"'ACI 1'!D10","v":"{Fill in}"},"Device ID:","{Fill in}","LC-MS Database:",null,"{Fill in}"]
["Nominal Fill Weight, mg: ",{"$f":"'ACI 1'!B11","v":"{Fill in}"},"Average DU, mg:",{"$f":"'ACI 1'!D11","v":"{Fill in}"},"Practical By:","{Fill in}","Date Reported: ",null,"{Fill in}"]
["Product Name:",{"$f":"'ACI 1'!B12","v":"{Fill in}"},"Label Claim:",{"$f":"'ACI 1'!D12","v":"{Fill in}"},null,null,"Reported By:",null,"{Fill in}"]
[]
["Description of Test Purpose (include storage conditions and/or timepoint if applicable):"]
[{"$f":"'ACI 1'!A15","v":"{Fill in}"}]
[]
["Sample","Conc (µg/mL)","Volume (mL)","Dilution\n(e.g. 1/2)","Amount per Capsule (mg)",null,"Sample ","µg/mL Injection Concentration","µg/mL Average Concentration","% Difference"]
[]
["Capsule",{"$f":"+I19","v":{"$error":"#DIV/0!"}},"{Fill in}",{"v":1,"d":"1.0"},{"$f":"IF(H19=\"{Fill in}\",\"N/A\",(B19*C19)/(D19*1000))","v":"N/A"},null,"Capsule","{Fill in}",{"$f":"AVERAGE(H19:H20)","v":{"$error":"#DIV/0!"}},{"$f":"(((MAX(H19:H20))-(MIN(H19:H20)))/I19)*100","v":{"$error":"#DIV/0!"}}]
["Inhaler",{"$f":"+I21","v":{"$error":"#DIV/0!"}},"{Fill in}",{"v":1,"d":"1.0"},{"$f":"IF(H21=\"{Fill in}\",\"N/A\",(B20*C20)/(D20*1000))","v":"N/A"},null,"Capsule","{Fill in}"]
["Adpt, Thrt, Pre-sep",{"$f":"+I23","v":{"$error":"#DIV/0!"}},"{Fill in}",{"v":1,"d":"1.0"},{"$f":"IF(H23=\"{Fill in}\",\"N/A\",(B21*C21)/(D21*1000))","v":"N/A"},null,"Inhaler","{Fill in}",{"$f":"AVERAGE(H21:H22)","v":{"$error":"#DIV/0!"}},{"$f":"(((MAX(H21:H22))-(MIN(H21:H22)))/I21)*100","v":{"$error":"#DIV/0!"}}]
["Stage -1",{"$f":"+I25","v":{"$error":"#DIV/0!"}},"{Fill in}",{"v":1,"d":"1.0"},{"$f":"IF(H25=\"{Fill in}\",\"N/A\",(B22*C22)/(D22*1000))","v":"N/A"},null,"Inhaler","{Fill in}"]
["Stage -0",{"$f":"+I27","v":{"$error":"#DIV/0!"}},"{Fill in}",{"v":1,"d":"1.0"},{"$f":"IF(H27=\"{Fill in}\",\"N/A\",(B23*C23)/(D23*1000))","v":"N/A"},null,"Adpt, Thrt, Pre-sep","{Fill in}",{"$f":"AVERAGE(H23:H24)","v":{"$error":"#DIV/0!"}},{"$f":"(((MAX(H23:H24))-(MIN(H23:H24)))/I23)*100","v":{"$error":"#DIV/0!"}}]
["Stage 1",{"$f":"+I29","v":{"$error":"#DIV/0!"}},"{Fill in}",{"v":1,"d":"1.0"},{"$f":"IF(H29=\"{Fill in}\",\"N/A\",(B24*C24)/(D24*1000))","v":"N/A"},null,"Adpt, Thrt, Pre-sep","{Fill in}"]
["Stage 2",{"$f":"+I31","v":{"$error":"#DIV/0!"}},"{Fill in}",{"v":1,"d":"1.0"},{"$f":"IF(H31=\"{Fill in}\",\"N/A\",(B25*C25)/(D25*1000))","v":"N/A"},null,"Stage -1","{Fill in}",{"$f":"AVERAGE(H25:H26)","v":{"$error":"#DIV/0!"}},{"$f":"(((MAX(H25:H26))-(MIN(H25:H26)))/I25)*100","v":{"$error":"#DIV/0!"}}]
["Stage 3",{"$f":"+I33","v":{"$error":"#DIV/0!"}},"{Fill in}",{"v":1,"d":"1.0"},{"$f":"IF(H33=\"{Fill in}\",\"N/A\",(B26*C26)/(D26*1000))","v":"N/A"},null,"Stage -1","{Fill in}"]
["Stage 4",{"$f":"+I35","v":{"$error":"#DIV/0!"}},"{Fill in}",{"v":1,"d":"1.0"},{"$f":"IF(H35=\"{Fill in}\",\"N/A\",(B27*C27)/(D27*1000))","v":"N/A"},null,"Stage -0","{Fill in}",{"$f":"AVERAGE(H27:H28)","v":{"$error":"#DIV/0!"}},{"$f":"(((MAX(H27:H28))-(MIN(H27:H28)))/I27)*100","v":{"$error":"#DIV/0!"}}]
["Stage 5",{"$f":"+I37","v":{"$error":"#DIV/0!"}},"{Fill in}",{"v":1,"d":"1.0"},{"$f":"IF(H37=\"{Fill in}\",\"N/A\",(B28*C28)/(D28*1000))","v":"N/A"},null,"Stage -0 ","{Fill in}"]
["Stage 6",{"$f":"+I39","v":{"$error":"#DIV/0!"}},"{Fill in}",{"v":1,"d":"1.0"},{"$f":"IF(H39=\"{Fill in}\",\"N/A\",(B29*C29)/(D29*1000))","v":"N/A"},null,"Stage 1","{Fill in}",{"$f":"AVERAGE(H29:H30)","v":{"$error":"#DIV/0!"}},{"$f":"(((MAX(H29:H30))-(MIN(H29:H30)))/I29)*100","v":{"$error":"#DIV/0!"}}]
["Filter",{"$f":"+I41","v":{"$error":"#DIV/0!"}},"{Fill in}",{"v":1,"d":"1.0"},{"$f":"IF(H41=\"{Fill in}\",\"N/A\",(B30*C30)/(D30*1000))","v":"N/A"},null,"Stage 1","{Fill in}"]
["Casing",{"$f":"+I43","v":{"$error":"#DIV/0!"}},"{Fill in}",{"v":1,"d":"1.0"},{"$f":"IF(H43=\"{Fill in}\",\"N/A\",(B31*C31)/(D31*1000))","v":"N/A"},null,"Stage 2","{Fill in}",{"$f":"AVERAGE(H31:H32)","v":{"$error":"#DIV/0!"}},{"$f":"(((MAX(H31:H32))-(MIN(H31:H32)))/I31)*100","v":{"$error":"#DIV/0!"}}]
[{"$nulls":6},"Stage 2","{Fill in}"]
["Fine Particle Fraction (%)",null,{"$f":"IF(D57=\"N/A\",\"N/A\",D57/C35*100)","v":"N/A"},{"$nulls":3},"Stage 3","{Fill in}",{"$f":"AVERAGE(H33:H34)","v":{"$error":"#DIV/0!"}},{"$f":"(((MAX(H33:H34))-(MIN(H33:H34)))/I33)*100","v":{"$error":"#DIV/0!"}}]
["Total Amount (mg)",null,{"$f":"IF(H19=\"{Fill in}\",\"N/A\",SUM(E19:E31))","v":"N/A"}," ",null,null,"Stage 3","{Fill in}"]
["Amount Emitted to ACI (mg)",null,{"$f":"IF(E21=\"N/A\",\"N/A\",SUM(E21:E31))","v":"N/A"},{"$nulls":3},"Stage 4","{Fill in}",{"$f":"AVERAGE(H35:H36)","v":{"$error":"#DIV/0!"}},{"$f":"(((MAX(H35:H36))-(MIN(H35:H36)))/I35)*100","v":{"$error":"#DIV/0!"}}]
["% Mass Balance of Label Claim",null,{"$f":"IF(C35=\"N/A\", \"N/A\", ((C35/D12)*100))","v":"N/A"},{"$nulls":3},"Stage 4","{Fill in}"]
["Recovery %, Fill weight",null,{"$f":"IF(H19=\"{Fill in}\",\"N/A\",100*C34/B11)","v":"N/A"},{"$nulls":3},"Stage 5","{Fill in}",{"$f":"AVERAGE(H37:H38)","v":{"$error":"#DIV/0!"}},{"$f":"(((MAX(H37:H38))-(MIN(H37:H38)))/I37)*100","v":{"$error":"#DIV/0!"}}]
[" Recovery %, DU result (75-125%)",null,{"$f":"IF(D11=\"{Fill in}\",\"N/A\",100*C35/D11)","v":"N/A"},{"$f":"IF((ROUND(C38,0))<75,\"LOW\",(IF((ROUND(C38,0))<=125,\"COMPLIES\",\"HIGH\")))","v":{"$error":"#VALUE!"}},null,null,"Stage 5","{Fill in}"]
[{"$nulls":6},"Stage 6","{Fill in}",{"$f":"AVERAGE(H39:H40)","v":{"$error":"#DIV/0!"}},{"$f":"(((MAX(H39:H40))-(MIN(H39:H40)))/I39)*100","v":{"$error":"#DIV/0!"}}]
["Cumulative Stage","Cut off Diameter (µm)","Ln (Cut off diameter)","Cumulative Mass per Capsule (mg)","Cumulative Fraction %",null,"Stage 6","{Fill in}"]
[{"$nulls":6},"Filter","{Fill in}",{"$f":"AVERAGE(H41:H42)","v":{"$error":"#DIV/0!"}},{"$f":"(((MAX(H41:H42))-(MIN(H41:H42)))/I41)*100","v":{"$error":"#DIV/0!"}}]
["C"," ",null,{"$f":"D43+E22","v":{"$error":"#VALUE!"}},{"$f":"100*(D42/$D$42)","v":{"$error":"#VALUE!"}},null,"Filter","{Fill in}"]
["C0",8.6,{"$f":"LN(B43)","v":{"v":2.151762203259462,"d":"2.2"}},{"$error":"#VALUE!"},{"$f":"100*(D43/$D$42)","v":{"$error":"#VALUE!"}},null,"Casing","{Fill in}",{"$f":"AVERAGE(H43:H44)","v":{"$error":"#DIV/0!"}},{"$f":"(((MAX(H43:H44))-(MIN(H43:H44)))/I43)*100","v":{"$error":"#DIV/0!"}}]
["C1",6.5,{"$f":"LN(B44)","v":{"v":1.8718021769015913,"d":"1.9"}},{"$error":"#VALUE!"},{"$error":"#VALUE!"},null,"Casing","{Fill in}"]
["C2",4.4,{"v":1.4816045409242156,"d":"1.5"},{"$error":"#VALUE!"},{"$error":"#VALUE!"}]
["C3",3.2,{"v":1.1631508098056809,"d":"1.2"},{"$error":"#VALUE!"},{"$error":"#VALUE!"}]
["C4",1.9,{"v":0.6418538861723947,"d":"0.6"},{"$error":"#VALUE!"},{"$error":"#VALUE!"}]
["C5",1.2,{"v":0.1823215567939546,"d":"0.2"},{"$error":"#VALUE!"},{"$error":"#VALUE!"}]
["C6",0.55,{"v":-0.5978370007556204,"d":"-0.6"},{"$error":"#VALUE!"},{"$error":"#VALUE!"}]
["C7",0.26,{"v":-1.3470736479666092,"d":"-1.3"},{"$f":"E30","v":"N/A"},{"$error":"#VALUE!"}]
[]
["FPD (mg < 5 µm)",null,"y  =  m Ln (5) + c"]
[]
["m","c","r2"]
[{"$f":"LINEST(D44:D46,C44:C46)","v":{"$error":"#VALUE!"}},{"$error":"#VALUE!"},{"$f":"POWER((CORREL(D44:D46,C44:C46)),2)","v":{"$error":"#VALUE!"}}]
[]
["FPD per Capsule (< 5µm, mg) =",null,null,{"$f":"IF(B8=\"{Fill in}\",\"N/A\",A55*LN(5)+B55)","v":"N/A"}]
[]
["MMAD and GSD",null,"x = Exp((y - c)/m)"]
[]
["y, Cumulative %","m","c","r2","x, Diameter, µm"]
[50,{"$f":"LINEST(E44:E46,C44:C46)","v":{"$error":"#VALUE!"}},{"$error":"#VALUE!"},{"$f":"POWER((CORREL(E44:E46,C44:C46)),2)","v":{"$error":"#VALUE!"}},{"$f":"EXP((A62-C62)/B62)","v":{"$error":"#VALUE!"}}]
[15.87,{"$f":"LINEST(E46:E48,C46:C48)","v":{"$error":"#VALUE!"}},{"$error":"#VALUE!"},{"$f":"POWER((CORREL(E46:E48,C46:C48)),2)","v":{"$error":"#VALUE!"}},{"$f":"EXP((A63-C63)/B63)","v":{"$error":"#VALUE!"}}]
[84.13,{"$f":"LINEST(E43:E45,C43:C45)","v":{"$error":"#VALUE!"}},{"$error":"#VALUE!"},{"$f":"POWER((CORREL(E43:E45,C43:C45)),2)","v":{"$error":"#VALUE!"}},{"$f":"EXP((A64-C64)/B64)","v":{"$error":"#VALUE!"}}]
[]
["MMAD, µm :",{"$f":"IF(B8=\"{Fill in}\",\"N/A\",E62)","v":"N/A"}]
["GSD :",{"$f":"IF(B8=\"{Fill in}\",\"N/A\",SQRT(E64/E63))","v":"N/A"}]
[]
["Mannitol Recovered from Stage Groupings (mg)"]
[]
["ATP to Stage -0",{"$f":"IF(B11=40,IF(E21=\"N/A\",\"N/A\",(IF(E22=\"N/A\",\"N/A\",(IF(E23=\"N/A\",\"N/A\",SUM(E21:E23)))))),\"N/A\")","v":"N/A"}]
["Stages 1 to 3",{"$f":"IF(B11=40,IF(E24=\"N/A\",\"N/A\",(IF(E25=\"N/A\",\"N/A\",(IF(E26=\"N/A\",\"N/A\",SUM(E24:E26)))))),\"N/A\")","v":"N/A"}]
["Stages 4 to 6",{"$f":"IF(B11=40,IF(E27=\"N/A\",\"N/A\",(IF(E28=\"N/A\",\"N/A\",(IF(E29=\"N/A\",\"N/A\",SUM(E27:E29)))))),\"N/A\")","v":"N/A"}]
["Filter",{"$f":"IF(B11=40, E30, \"N/A\")","v":"N/A"}]
[]
[]
["Reported By:"]
["(Sign & Date)"]

{"sheet":"ACI 6","index":5,"n_rows":78,"n_cols":10,"rows_kept":78,"merged":[[16,0,17,0],[16,1,17,1],[16,2,17,2],[16,3,17,3],[16,4,17,4],[16,6,17,6],[16,7,17,7],[16,8,17,8],[16,9,17,9],[18,8,19,8],[18,9,19,9],[20,8,21,8],[20,9,21,9],[22,8,23,8],[22,9,23,9],[24,8,25,8],[24,9,25,9],[26,8,27,8],[26,9,27,9],[28,8,29,8],[28,9,29,9],[30,8,31,8],[30,9,31,9],[32,0,32,1],[32,8,33,8],[32,9,33,9],[33,0,33,1],[34,0,34,1],[34,8,35,8],[34,9,35,9],[35,0,35,1],[36,0,36,1],[36,8,37,8],[36,9,37,9],[37,0,37,1],[38,8,39,8],[38,9,39,9],[39,0,40,0],[39,1,40,1],[39,2,40,2],[39,3,40,3],[39,4,40,4],[40,8,41,8],[40,9,41,9],[42,8,43,8],[42,9,43,9],[68,0,69,1],[92,11,92,12]]}
[{"$f":"'ACI 1'!A1","v":"QUALITY CONTROL DEPARTMENT"}]
[{"$f":"'ACI 1'!A2","v":"MES-013-07 Andersen Cascade Impactor Result Sheet for Flowrate of 60L/min"}]
[{"$f":"'ACI 1'!A3","v":"Associated Documents: TM-003"}]
[{"$f":"'ACI 1'!A4","v":"To be used with Excel 2016 only. Last Modified by P. Lillo 05-Feb-19."}]
[]
["Sixth Replicate Result"]
[]
["Date Tested:","{Fill in}","Flow rate, LPM:","{Fill in}","Lab Sample No.:","{Fill in}","LC-MS Sequence File Name:",null,"{Fill in}"]
["TRF No.:",{"$f":"'ACI 1'!B9","v":"{Fill in}"},"Device Type:",{"$f":"'ACI 1'!D9","v":"{Fill in}"},"Sample ID:","{Fill in}","Calibration Reference (s):",null,"{Fill in}"]
["Product Batch:",{"$f":"'ACI 1'!B10","v":"{Fill in}"},"Device IGN:",{"$f":"'ACI 1'!D10","v":"{Fill in}"},"Device ID:","{Fill in}","LC-MS Database:",null,"{Fill in}"]
["Nominal Fill Weight, mg: ",{"$f":"'ACI 1'!B11","v":"{Fill in}"},"Average DU, mg:",{"$f":"'ACI 1'!D11","v":"{Fill in}"},"Practical By:","{Fill in}","Date Reported: ",null,"{Fill in}"]
["Product Name:",{"$f":"'ACI 1'!B12","v":"{Fill in}"},"Label Claim:",{"$f":"'ACI 1'!D12","v":"{Fill in}"},null,null,"Reported By:",null,"{Fill in}"]
[]
["Description of Test Purpose (include storage conditions and/or timepoint if applicable):"]
[{"$f":"'ACI 1'!A15","v":"{Fill in}"}]
[]
["Sample","Conc (µg/mL)","Volume (mL)","Dilution\n(e.g. 1/2)","Amount per Capsule (mg)",null,"Sample ","µg/mL Injection Concentration","µg/mL Average Concentration","% Difference"]
[]
["Capsule",{"$f":"+I19","v":{"$error":"#DIV/0!"}},"{Fill in}",{"v":1,"d":"1.0"},{"$f":"IF(H19=\"{Fill in}\",\"N/A\",(B19*C19)/(D19*1000))","v":"N/A"},null,"Capsule","{Fill in}",{"$f":"AVERAGE(H19:H20)","v":{"$error":"#DIV/0!"}},{"$f":"(((MAX(H19:H20))-(MIN(H19:H20)))/I19)*100","v":{"$error":"#DIV/0!"}}]
["Inhaler",{"$f":"+I21","v":{"$error":"#DIV/0!"}},"{Fill in}",{"v":1,"d":"1.0"},{"$f":"IF(H21=\"{Fill in}\",\"N/A\",(B20*C20)/(D20*1000))","v":"N/A"},null,"Capsule","{Fill in}"]
["Adpt, Thrt, Pre-sep",{"$f":"+I23","v":{"$error":"#DIV/0!"}},"{Fill in}",{"v":1,"d":"1.0"},{"$f":"IF(H23=\"{Fill in}\",\"N/A\",(B21*C21)/(D21*1000))","v":"N/A"},null,"Inhaler","{Fill in}",{"$f":"AVERAGE(H21:H22)","v":{"$error":"#DIV/0!"}},{"$f":"(((MAX(H21:H22))-(MIN(H21:H22)))/I21)*100","v":{"$error":"#DIV/0!"}}]
["Stage -1",{"$f":"+I25","v":{"$error":"#DIV/0!"}},"{Fill in}",{"v":1,"d":"1.0"},{"$f":"IF(H25=\"{Fill in}\",\"N/A\",(B22*C22)/(D22*1000))","v":"N/A"},null,"Inhaler","{Fill in}"]
["Stage -0",{"$f":"+I27","v":{"$error":"#DIV/0!"}},"{Fill in}",{"v":1,"d":"1.0"},{"$f":"IF(H27=\"{Fill in}\",\"N/A\",(B23*C23)/(D23*1000))","v":"N/A"},null,"Adpt, Thrt, Pre-sep","{Fill in}",{"$f":"AVERAGE(H23:H24)","v":{"$error":"#DIV/0!"}},{"$f":"(((MAX(H23:H24))-(MIN(H23:H24)))/I23)*100","v":{"$error":"#DIV/0!"}}]
["Stage 1",{"$f":"+I29","v":{"$error":"#DIV/0!"}},"{Fill in}",{"v":1,"d":"1.0"},{"$f":"IF(H29=\"{Fill in}\",\"N/A\",(B24*C24)/(D24*1000))","v":"N/A"},null,"Adpt, Thrt, Pre-sep","{Fill in}"]
["Stage 2",{"$f":"+I31","v":{"$error":"#DIV/0!"}},"{Fill in}",{"v":1,"d":"1.0"},{"$f":"IF(H31=\"{Fill in}\",\"N/A\",(B25*C25)/(D25*1000))","v":"N/A"},null,"Stage -1","{Fill in}",{"$f":"AVERAGE(H25:H26)","v":{"$error":"#DIV/0!"}},{"$f":"(((MAX(H25:H26))-(MIN(H25:H26)))/I25)*100","v":{"$error":"#DIV/0!"}}]
["Stage 3",{"$f":"+I33","v":{"$error":"#DIV/0!"}},"{Fill in}",{"v":1,"d":"1.0"},{"$f":"IF(H33=\"{Fill in}\",\"N/A\",(B26*C26)/(D26*1000))","v":"N/A"},null,"Stage -1","{Fill in}"]
["Stage 4",{"$f":"+I35","v":{"$error":"#DIV/0!"}},"{Fill in}",{"v":1,"d":"1.0"},{"$f":"IF(H35=\"{Fill in}\",\"N/A\",(B27*C27)/(D27*1000))","v":"N/A"},null,"Stage -0","{Fill in}",{"$f":"AVERAGE(H27:H28)","v":{"$error":"#DIV/0!"}},{"$f":"(((MAX(H27:H28))-(MIN(H27:H28)))/I27)*100","v":{"$error":"#DIV/0!"}}]
["Stage 5",{"$f":"+I37","v":{"$error":"#DIV/0!"}},"{Fill in}",{"v":1,"d":"1.0"},{"$f":"IF(H37=\"{Fill in}\",\"N/A\",(B28*C28)/(D28*1000))","v":"N/A"},null,"Stage -0 ","{Fill in}"]
["Stage 6",{"$f":"+I39","v":{"$error":"#DIV/0!"}},"{Fill in}",{"v":1,"d":"1.0"},{"$f":"IF(H39=\"{Fill in}\",\"N/A\",(B29*C29)/(D29*1000))","v":"N/A"},null,"Stage 1","{Fill in}",{"$f":"AVERAGE(H29:H30)","v":{"$error":"#DIV/0!"}},{"$f":"(((MAX(H29:H30))-(MIN(H29:H30)))/I29)*100","v":{"$error":"#DIV/0!"}}]
["Filter",{"$f":"+I41","v":{"$error":"#DIV/0!"}},"{Fill in}",{"v":1,"d":"1.0"},{"$f":"IF(H41=\"{Fill in}\",\"N/A\",(B30*C30)/(D30*1000))","v":"N/A"},null,"Stage 1","{Fill in}"]
["Casing",{"$f":"+I43","v":{"$error":"#DIV/0!"}},"{Fill in}",{"v":1,"d":"1.0"},{"$f":"IF(H43=\"{Fill in}\",\"N/A\",(B31*C31)/(D31*1000))","v":"N/A"},null,"Stage 2","{Fill in}",{"$f":"AVERAGE(H31:H32)","v":{"$error":"#DIV/0!"}},{"$f":"(((MAX(H31:H32))-(MIN(H31:H32)))/I31)*100","v":{"$error":"#DIV/0!"}}]
[{"$nulls":6},"Stage 2","{Fill in}"]
["Fine Particle Fraction (%)",null,{"$f":"IF(D57=\"N/A\",\"N/A\",D57/C35*100)","v":"N/A"},{"$nulls":3},"Stage 3","{Fill in}",{"$f":"AVERAGE(H33:H34)","v":{"$error":"#DIV/0!"}},{"$f":"(((MAX(H33:H34))-(MIN(H33:H34)))/I33)*100","v":{"$error":"#DIV/0!"}}]
["Total Amount (mg)",null,{"$f":"IF(H19=\"{Fill in}\",\"N/A\",SUM(E19:E31))","v":"N/A"}," ",null,null,"Stage 3","{Fill in}"]
["Amount Emitted to ACI (mg)",null,{"$f":"IF(E21=\"N/A\",\"N/A\",SUM(E21:E31))","v":"N/A"},{"$nulls":3},"Stage 4","{Fill in}",{"$f":"AVERAGE(H35:H36)","v":{"$error":"#DIV/0!"}},{"$f":"(((MAX(H35:H36))-(MIN(H35:H36)))/I35)*100","v":{"$error":"#DIV/0!"}}]
["% Mass Balance of Label Claim",null,{"$f":"IF(C35=\"N/A\", \"N/A\", ((C35/D12)*100))","v":"N/A"},{"$nulls":3},"Stage 4","{Fill in}"]
["Recovery %, Fill weight",null,{"$f":"IF(H19=\"{Fill in}\",\"N/A\",100*C34/B11)","v":"N/A"},{"$nulls":3},"Stage 5","{Fill in}",{"$f":"AVERAGE(H37:H38)","v":{"$error":"#DIV/0!"}},{"$f":"(((MAX(H37:H38))-(MIN(H37:H38)))/I37)*100","v":{"$error":"#DIV/0!"}}]
[" Recovery %, DU result (75-125%)",null,{"$f":"IF(D11=\"{Fill in}\",\"N/A\",100*C35/D11)","v":"N/A"},{"$f":"IF((ROUND(C38,0))<75,\"LOW\",(IF((ROUND(C38,0))<=125,\"COMPLIES\",\"HIGH\")))","v":{"$error":"#VALUE!"}},null,null,"Stage 5","{Fill in}"]
[{"$nulls":6},"Stage 6","{Fill in}",{"$f":"AVERAGE(H39:H40)","v":{"$error":"#DIV/0!"}},{"$f":"(((MAX(H39:H40))-(MIN(H39:H40)))/I39)*100","v":{"$error":"#DIV/0!"}}]
["Cumulative Stage","Cut off Diameter (µm)","Ln (Cut off diameter)","Cumulative Mass per Capsule (mg)","Cumulative Fraction %",null,"Stage 6","{Fill in}"]
[{"$nulls":6},"Filter","{Fill in}",{"$f":"AVERAGE(H41:H42)","v":{"$error":"#DIV/0!"}},{"$f":"(((MAX(H41:H42))-(MIN(H41:H42)))/I41)*100","v":{"$error":"#DIV/0!"}}]
["C"," ",null,{"$f":"D43+E22","v":{"$error":"#VALUE!"}},{"$f":"100*(D42/$D$42)","v":{"$error":"#VALUE!"}},null,"Filter","{Fill in}"]
["C0",8.6,{"$f":"LN(B43)","v":{"v":2.151762203259462,"d":"2.2"}},{"$error":"#VALUE!"},{"$f":"100*(D43/$D$42)","v":{"$error":"#VALUE!"}},null,"Casing","{Fill in}",{"$f":"AVERAGE(H43:H44)","v":{"$error":"#DIV/0!"}},{"$f":"(((MAX(H43:H44))-(MIN(H43:H44)))/I43)*100","v":{"$error":"#DIV/0!"}}]
["C1",6.5,{"$f":"LN(B44)","v":{"v":1.8718021769015913,"d":"1.9"}},{"$error":"#VALUE!"},{"$error":"#VALUE!"},null,"Casing","{Fill in}"]
["C2",4.4,{"v":1.4816045409242156,"d":"1.5"},{"$error":"#VALUE!"},{"$error":"#VALUE!"}]
["C3",3.2,{"v":1.1631508098056809,"d":"1.2"},{"$error":"#VALUE!"},{"$error":"#VALUE!"}]
["C4",1.9,{"v":0.6418538861723947,"d":"0.6"},{"$error":"#VALUE!"},{"$error":"#VALUE!"}]
["C5",1.2,{"v":0.1823215567939546,"d":"0.2"},{"$error":"#VALUE!"},{"$error":"#VALUE!"}]
["C6",0.55,{"v":-0.5978370007556204,"d":"-0.6"},{"$error":"#VALUE!"},{"$error":"#VALUE!"}]
["C7",0.26,{"v":-1.3470736479666092,"d":"-1.3"},{"$f":"E30","v":"N/A"},{"$error":"#VALUE!"}]
[]
["FPD (mg < 5 µm)",null,"y  =  m Ln (5) + c"]
[]
["m","c","r2"]
[{"$f":"LINEST(D44:D46,C44:C46)","v":{"$error":"#VALUE!"}},{"$error":"#VALUE!"},{"$f":"POWER((CORREL(D44:D46,C44:C46)),2)","v":{"$error":"#VALUE!"}}]
[]
["FPD per Capsule (< 5µm, mg) =",null,null,{"$f":"IF(B8=\"{Fill in}\",\"N/A\",A55*LN(5)+B55)","v":"N/A"}]
[]
["MMAD and GSD",null,"x = Exp((y - c)/m)"]
[]
["y, Cumulative %","m","c","r2","x, Diameter, µm"]
[50,{"$f":"LINEST(E44:E46,C44:C46)","v":{"$error":"#VALUE!"}},{"$error":"#VALUE!"},{"$f":"POWER((CORREL(E44:E46,C44:C46)),2)","v":{"$error":"#VALUE!"}},{"$f":"EXP((A62-C62)/B62)","v":{"$error":"#VALUE!"}}]
[15.87,{"$f":"LINEST(E46:E48,C46:C48)","v":{"$error":"#VALUE!"}},{"$error":"#VALUE!"},{"$f":"POWER((CORREL(E46:E48,C46:C48)),2)","v":{"$error":"#VALUE!"}},{"$f":"EXP((A63-C63)/B63)","v":{"$error":"#VALUE!"}}]
[84.13,{"$f":"LINEST(E43:E45,C43:C45)","v":{"$error":"#VALUE!"}},{"$error":"#VALUE!"},{"$f":"POWER((CORREL(E43:E45,C43:C45)),2)","v":{"$error":"#VALUE!"}},{"$f":"EXP((A64-C64)/B64)","v":{"$error":"#VALUE!"}}]
[]
["MMAD, µm :",{"$f":"IF(B8=\"{Fill in}\",\"N/A\",E62)","v":"N/A"}]
["GSD :",{"$f":"IF(B8=\"{Fill in}\",\"N/A\",SQRT(E64/E63))","v":"N/A"}]
[]
["Mannitol Recovered from Stage Groupings (mg)"]
[]
["ATP to Stage -0",{"$f":"IF(B11=40,IF(E21=\"N/A\",\"N/A\",(IF(E22=\"N/A\",\"N/A\",(IF(E23=\"N/A\",\"N/A\",SUM(E21:E23)))))),\"N/A\")","v":"N/A"}]
["Stages 1 to 3",{"$f":"IF(B11=40,IF(E24=\"N/A\",\"N/A\",(IF(E25=\"N/A\",\"N/A\",(IF(E26=\"N/A\",\"N/A\",SUM(E24:E26)))))),\"N/A\")","v":"N/A"}]
["Stages 4 to 6",{"$f":"IF(B11=40,IF(E27=\"N/A\",\"N/A\",(IF(E28=\"N/A\",\"N/A\",(IF(E29=\"N/A\",\"N/A\",SUM(E27:E29)))))),\"N/A\")","v":"N/A"}]
["Filter",{"$f":"IF(B11=40, E30, \"N/A\")","v":"N/A"}]
[]
[]
["Reported By:"]
["(Sign & Date)"]

{"sheet":"Average ACI","index":6,"n_rows":80,"n_cols":7,"rows_kept":80,"merged":[[14,0,15,0],[14,1,15,1],[14,2,15,2],[14,3,15,3],[14,4,15,5],[14,6,15,6],[16,4,16,5],[17,4,17,5],[18,4,18,5],[19,4,19,5],[20,4,20,5],[21,4,21,5],[23,0,24,0],[23,1,24,1],[23,2,24,2],[23,3,24,3],[34,5,35,6],[39,5,39,6],[40,5,40,6],[41,5,41,6],[42,5,42,6],[47,1,47,4],[48,5,48,6],[49,6,52,6]]}
[{"$f":"'ACI 1'!A1","v":"QUALITY CONTROL DEPARTMENT"}]
[{"$f":"'ACI 1'!A2","v":"MES-013-07 Andersen Cascade Impactor Result Sheet for Flowrate of 60L/min"}]
[{"$f":"'ACI 1'!A3","v":"Associated Documents: TM-003"}]
[{"$f":"'ACI 1'!A4","v":"To be used with Excel 2016 only. Last Modified by P. Lillo 05-Feb-19."}]
[]
["Summary of Results Sheet"]
[]
["Product Name:",{"$f":"'ACI 1'!B12","v":"{Fill in}"},"Device Type:",{"$f":"'ACI 1'!D9","v":"{Fill in}"},null,"Label Claim:",{"$f":"'ACI 1'!D12","v":"{Fill in}"}]
["Product Batch:",{"$f":"'ACI 1'!B10","v":"{Fill in}"},"Device IGN:",{"$f":"'ACI 1'!D10","v":"{Fill in}"},null,"Date Reported: ","{Fill in}"]
["Capsule Dosage (mg):",{"$f":"'ACI 1'!B11","v":"{Fill in}"},"TRF No.:",{"$f":"'ACI 1'!B9","v":"{Fill in}"},null,"Reported By: ","{Fill in}"]
[]
["Description of Test Purpose (include storage conditions and/or timepoint if applicable):"]
[{"$f":"'ACI 1'!A15","v":"{Fill in}"}]
[]
["ACI No.","Date Tested","Sample ID","Calibration Reference","Sequence Name",null,"FPD\n(mg <5µm)                  "]
[]
[1,{"$f":"IF('ACI 1'!B8=\"{Fill in}\",\"N/A\",'ACI 1'!B8)","v":"N/A"},{"$f":"IF('ACI 1'!F9=\"{Fill in}\",\"N/A\",'ACI 1'!F9)","v":"N/A"},{"$f":"IF('ACI 1'!I9=\"{Fill in}\",\"N/A\",'ACI 1'!I9)","v":"N/A"},{"$f":"IF('ACI 1'!I8=\"{Fill in}\",\"N/A\",'ACI 1'!I8)","v":"N/A"},null,{"$f":"'ACI 1'!$D$57","v":"N/A"}]
[2,{"$f":"IF('ACI 2'!B8=\"{Fill in}\",\"N/A\",'ACI 2'!B8)","v":"N/A"},{"$f":"IF('ACI 2'!F9=\"{Fill in}\",\"N/A\",'ACI 2'!F9)","v":"N/A"},{"$f":"IF('ACI 2'!I9=\"{Fill in}\",\"N/A\",'ACI 2'!I9)","v":"N/A"},{"$f":"IF('ACI 2'!I8=\"{Fill in}\",\"N/A\",'ACI 2'!I8)","v":"N/A"},null,{"$f":"'ACI 2'!$D$57","v":"N/A"}]
[3,{"$f":"IF('ACI 3'!B8=\"{Fill in}\",\"N/A\",'ACI 3'!B8)","v":"N/A"},{"$f":"IF('ACI 3'!F9=\"{Fill in}\",\"N/A\",'ACI 3'!F9)","v":"N/A"},{"$f":"IF('ACI 3'!I9=\"{Fill in}\",\"N/A\",'ACI 3'!I9)","v":"N/A"},{"$f":"IF('ACI 3'!I8=\"{Fill in}\",\"N/A\",'ACI 3'!I8)","v":"N/A"},null,{"$f":"'ACI 3'!$D$57","v":"N/A"}]
[4,{"$f":"IF('ACI 4'!B8=\"{Fill in}\",\"N/A\",'ACI 4'!B8)","v":"N/A"},{"$f":"IF('ACI 4'!F9=\"{Fill in}\",\"N/A\",'ACI 4'!F9)","v":"N/A"},{"$f":"IF('ACI 4'!I9=\"{Fill in}\",\"N/A\",'ACI 4'!I9)","v":"N/A"},{"$f":"IF('ACI 4'!I8=\"{Fill in}\",\"N/A\",'ACI 4'!I8)","v":"N/A"},null,{"$f":"'ACI 4'!$D$57","v":"N/A"}]
[5,{"$f":"IF('ACI 5'!B8=\"{Fill in}\",\"N/A\",'ACI 5'!B8)","v":"N/A"},{"$f":"IF('ACI 5'!F9=\"{Fill in}\",\"N/A\",'ACI 5'!F9)","v":"N/A"},{"$f":"IF('ACI 5'!I9=\"{Fill in}\",\"N/A\",'ACI 5'!I9)","v":"N/A"},{"$f":"IF('ACI 5'!I8=\"{Fill in}\",\"N/A\",'ACI 5'!I8)","v":"N/A"},null,{"$f":"'ACI 5'!$D$57","v":"N/A"}]
[6,{"$f":"IF('ACI 6'!B8=\"{Fill in}\",\"N/A\",'ACI 6'!B8)","v":"N/A"},{"$f":"IF('ACI 6'!F9=\"{Fill in}\",\"N/A\",'ACI 6'!F9)","v":"N/A"},{"$f":"IF('ACI 6'!I9=\"{Fill in}\",\"N/A\",'ACI 6'!I9)","v":"N/A"},{"$f":"IF('ACI 6'!I8=\"{Fill in}\",\"N/A\",'ACI 6'!I8)","v":"N/A"},null,{"$f":"'ACI 6'!$D$57","v":"N/A"}]
[{"$nulls":5},"Average",{"$f":"IF(G17=\"N/A\", \"N/A\",AVERAGE(G17:G22))","v":"N/A"}]
["Sample","Average Amount per Capsule (mg)","Max - Average\n(mg)","Average - Min\n(mg)",null,"%RSD",{"$f":"IF(G17=\"N/A\",\"N/A\",(100*STDEV(G17:G22)/G23))","v":"N/A"}]
[]
["Capsule",{"$f":"IF('ACI 1'!E19=\"N/A\", \"N/A\", AVERAGE('ACI 1'!E19,'ACI 2'!E19,'ACI 3'!E19,'ACI 4'!E19,'ACI 5'!E19,'ACI 6'!E19))","v":"N/A"},{"$f":"IF(B26=\"N/A\", \"N/A\", (MAX('ACI 1'!E19,'ACI 2'!E19,'ACI 3'!E19,'ACI 4'!E19,'ACI 5'!E19,'ACI 6'!E19))-B26)","v":"N/A"},{"$f":"IF(B26=\"N/A\", \"N/A\",B26-(MIN('ACI 1'!E19,'ACI 2'!E19,'ACI 3'!E19,'ACI 4'!E19,'ACI 5'!E19,'ACI 6'!E19)))","v":"N/A"},null,"Specification:","{Fill in}"]
["Inhaler",{"$f":"IF('ACI 1'!E20=\"N/A\",\"N/A\",AVERAGE('ACI 1'!E20,'ACI 2'!E20,'ACI 3'!E20,'ACI 4'!E20,'ACI 5'!E20,'ACI 6'!E20))","v":"N/A"},{"$f":"IF(B27=\"N/A\",\"N/A\", (MAX('ACI 1'!E20,'ACI 2'!E20,'ACI 3'!E20,'ACI 4'!E20,'ACI 5'!E20,'ACI 6'!E20))-B27)","v":"N/A"},{"$f":"IF(B27=\"N/A\",\"N/A\",B27-(MIN('ACI 1'!E20,'ACI 2'!E20,'ACI 3'!E20,'ACI 4'!E20,'ACI 5'!E20,'ACI 6'!E20)))","v":"N/A"}]
["A, T, P",{"$f":"AVERAGE('ACI 1'!E21,'ACI 2'!E21,'ACI 3'!E21,'ACI 4'!E21,'ACI 5'!E21,'ACI 6'!E21)","v":{"$error":"#DIV/0!"}},{"$f":"(MAX('ACI 1'!E21,'ACI 2'!E21,'ACI 3'!E21,'ACI 4'!E21,'ACI 5'!E21,'ACI 6'!E21))-B28","v":{"$error":"#DIV/0!"}},{"$f":"B28-(MIN('ACI 1'!E21,'ACI 2'!E21,'ACI 3'!E21,'ACI 4'!E21,'ACI 5'!E21,'ACI 6'!E21))","v":{"$error":"#DIV/0!"}},null,"FPD"]
["Stage -1",{"$f":"AVERAGE('ACI 1'!E22,'ACI 2'!E22,'ACI 3'!E22,'ACI 4'!E22,'ACI 5'!E22,'ACI 6'!E22)","v":{"$error":"#DIV/0!"}},{"$f":"(MAX('ACI 1'!E22,'ACI 2'!E22,'ACI 3'!E22,'ACI 4'!E22,'ACI 5'!E22,'ACI 6'!E22))-B29","v":{"$error":"#DIV/0!"}},{"$f":"B29-(MIN('ACI 1'!E22,'ACI 2'!E22,'ACI 3'!E22,'ACI 4'!E22,'ACI 5'!E22,'ACI 6'!E22))","v":{"$error":"#DIV/0!"}},null,"For Average of 3 Replicates"]
["Stage -0",{"$f":"AVERAGE('ACI 1'!E23,'ACI 2'!E23,'ACI 3'!E23,'ACI 4'!E23,'ACI 5'!E23,'ACI 6'!E23)","v":{"$error":"#DIV/0!"}},{"$f":"(MAX('ACI 1'!E23,'ACI 2'!E23,'ACI 3'!E23,'ACI 4'!E23,'ACI 5'!E23,'ACI 6'!E23))-B30","v":{"$error":"#DIV/0!"}},{"$f":"B30-(MIN('ACI 1'!E23,'ACI 2'!E23,'ACI 3'!E23,'ACI 4'!E23,'ACI 5'!E23,'ACI 6'!E23))","v":{"$error":"#DIV/0!"}},null,"ACI No.","FPD (mg, <5µm)"]
["Stage 1",{"$f":"AVERAGE('ACI 1'!E24,'ACI 2'!E24,'ACI 3'!E24,'ACI 4'!E24,'ACI 5'!E24,'ACI 6'!E24)","v":{"$error":"#DIV/0!"}},{"$f":"(MAX('ACI 1'!E24,'ACI 2'!E24,'ACI 3'!E24,'ACI 4'!E24,'ACI 5'!E24,'ACI 6'!E24))-B31","v":{"$error":"#DIV/0!"}},{"$f":"B31-(MIN('ACI 1'!E24,'ACI 2'!E24,'ACI 3'!E24,'ACI 4'!E24,'ACI 5'!E24,'ACI 6'!E24))","v":{"$error":"#DIV/0!"}},null,"{Enter number}",{"$f":"IF(F31=1,G17,IF(F31=2,G18,IF(F31=3,G19,IF(F31=4,G20,IF(F31=5,G21,IF(F31=6, G22,\"N/A\"))))))","v":"N/A"}]
["Stage 2",{"$f":"AVERAGE('ACI 1'!E25,'ACI 2'!E25,'ACI 3'!E25,'ACI 4'!E25,'ACI 5'!E25,'ACI 6'!E25)","v":{"$error":"#DIV/0!"}},{"$f":"(MAX('ACI 1'!E25,'ACI 2'!E25,'ACI 3'!E25,'ACI 4'!E25,'ACI 5'!E25,'ACI 6'!E25))-B32","v":{"$error":"#DIV/0!"}},{"$f":"B32-(MIN('ACI 1'!E25,'ACI 2'!E25,'ACI 3'!E25,'ACI 4'!E25,'ACI 5'!E25,'ACI 6'!E25))","v":{"$error":"#DIV/0!"}},null,"{Enter number}",{"$f":"IF(F32=1,G17,IF(F32=2,G18,IF(F32=3,G19,IF(F32=4,G20,IF(F32=5,G21,IF(F32=6, G22,\"N/A\"))))))","v":"N/A"}]
["Stage 3",{"$f":"AVERAGE('ACI 1'!E26,'ACI 2'!E26,'ACI 3'!E26,'ACI 4'!E26,'ACI 5'!E26,'ACI 6'!E26)","v":{"$error":"#DIV/0!"}},{"$f":"(MAX('ACI 1'!E26,'ACI 2'!E26,'ACI 3'!E26,'ACI 4'!E26,'ACI 5'!E26,'ACI 6'!E26))-B33","v":{"$error":"#DIV/0!"}},{"$f":"B33-(MIN('ACI 1'!E26,'ACI 2'!E26,'ACI 3'!E26,'ACI 4'!E26,'ACI 5'!E26,'ACI 6'!E26))","v":{"$error":"#DIV/0!"}},null,"{Enter number}",{"$f":"IF(F33=1,G17,IF(F33=2,G18,IF(F33=3,G19,IF(F33=4,G20,IF(F33=5,G21,IF(F33=6, G22,\"N/A\"))))))","v":"N/A"}]
["Stage 4",{"$f":"AVERAGE('ACI 1'!E27,'ACI 2'!E27,'ACI 3'!E27,'ACI 4'!E27,'ACI 5'!E27,'ACI 6'!E27)","v":{"$error":"#DIV/0!"}},{"$f":"(MAX('ACI 1'!E27,'ACI 2'!E27,'ACI 3'!E27,'ACI 4'!E27,'ACI 5'!E27,'ACI 6'!E27))-B34","v":{"$error":"#DIV/0!"}},{"$f":"B34-(MIN('ACI 1'!E27,'ACI 2'!E27,'ACI 3'!E27,'ACI 4'!E27,'ACI 5'!E27,'ACI 6'!E27))","v":{"$error":"#DIV/0!"}},null,"Average",{"$f":"IF(AND(G31=\"N/A\", G32=\"N/A\", G33=\"N/A\"), \"N/A\", AVERAGE(G31:G33))","v":"N/A"}]
["Stage 5",{"$f":"AVERAGE('ACI 1'!E28,'ACI 2'!E28,'ACI 3'!E28,'ACI 4'!E28,'ACI 5'!E28,'ACI 6'!E28)","v":{"$error":"#DIV/0!"}},{"$f":"(MAX('ACI 1'!E28,'ACI 2'!E28,'ACI 3'!E28,'ACI 4'!E28,'ACI 5'!E28,'ACI 6'!E28))-B35","v":{"$error":"#DIV/0!"}},{"$f":"B35-(MIN('ACI 1'!E28,'ACI 2'!E28,'ACI 3'!E28,'ACI 4'!E28,'ACI 5'!E28,'ACI 6'!E28))","v":{"$error":"#DIV/0!"}},null,"Ensure samples are from Start, Middle and End if applicable"]
["Stage 6",{"$f":"AVERAGE('ACI 1'!E29,'ACI 2'!E29,'ACI 3'!E29,'ACI 4'!E29,'ACI 5'!E29,'ACI 6'!E29)","v":{"$error":"#DIV/0!"}},{"$f":"(MAX('ACI 1'!E29,'ACI 2'!E29,'ACI 3'!E29,'ACI 4'!E29,'ACI 5'!E29,'ACI 6'!E29))-B36","v":{"$error":"#DIV/0!"}},{"$f":"B36-(MIN('ACI 1'!E29,'ACI 2'!E29,'ACI 3'!E29,'ACI 4'!E29,'ACI 5'!E29,'ACI 6'!E29))","v":{"$error":"#DIV/0!"}}]
["Filter",{"$f":"AVERAGE('ACI 1'!E30,'ACI 2'!E30,'ACI 3'!E30,'ACI 4'!E30,'ACI 5'!E30,'ACI 6'!E30)","v":{"$error":"#DIV/0!"}},{"$f":"(MAX('ACI 1'!E30,'ACI 2'!E30,'ACI 3'!E30,'ACI 4'!E30,'ACI 5'!E30,'ACI 6'!E30))-B37","v":{"$error":"#DIV/0!"}},{"$f":"B37-(MIN('ACI 1'!E30,'ACI 2'!E30,'ACI 3'!E30,'ACI 4'!E30,'ACI 5'!E30,'ACI 6'!E30))","v":{"$error":"#DIV/0!"}}]
["Casing",{"$f":"AVERAGE('ACI 1'!E31,'ACI 2'!E31,'ACI 3'!E31,'ACI 4'!E31,'ACI 5'!E31,'ACI 6'!E31)","v":{"$error":"#DIV/0!"}},{"$f":"(MAX('ACI 1'!E31,'ACI 2'!E31,'ACI 3'!E31,'ACI 4'!E31,'ACI 5'!E31,'ACI 6'!E31))-B38","v":{"$error":"#DIV/0!"}},{"$f":"B38-(MIN('ACI 1'!E31,'ACI 2'!E31,'ACI 3'!E31,'ACI 4'!E31,'ACI 5'!E31,'ACI 6'!E31))","v":{"$error":"#DIV/0!"}}]
["Total to ACI",{"$f":"AVERAGE('ACI 1'!C35,'ACI 2'!C35,'ACI 3'!C35,'ACI 4'!C35,'ACI 5'!C35,'ACI 6'!C35)","v":{"$error":"#DIV/0!"}},{"$f":"(MAX('ACI 1'!C35,'ACI 2'!C35,'ACI 3'!C35,'ACI 4'!C35,'ACI 5'!C35,'ACI 6'!C35))-B39","v":{"$error":"#DIV/0!"}},{"$f":"B39-(MIN('ACI 1'!C35,'ACI 2'!C35,'ACI 3'!C35,'ACI 4'!C35,'ACI 5'!C35,'ACI 6'!C35))","v":{"$error":"#DIV/0!"}},null,"FPD Specification (mg)","{Fill in Spec or N/A}"]
["FPD (mg <5µm)       ",{"$f":"AVERAGE('ACI 1'!D57,'ACI 2'!D57,'ACI 3'!D57,'ACI 4'!D57,'ACI 5'!D57,'ACI 6'!D57)","v":{"$error":"#DIV/0!"}},{"$f":"(MAX('ACI 1'!D57,'ACI 2'!D57,'ACI 3'!D57,'ACI 4'!D57,'ACI 5'!D57,'ACI 6'!D57))-B40","v":{"$error":"#DIV/0!"}},{"$f":"B40-(MIN('ACI 1'!D57,'ACI 2'!D57,'ACI 3'!D57,'ACI 4'!D57,'ACI 5'!D57,'ACI 6'!D57))","v":{"$error":"#DIV/0!"}},null,"Average of 3 replicates"]
[{"$nulls":5},{"$f":"IF(G39=\"N/A\", \"Not Applicable\", \"Complies   /   Does Not Comply  /  N/A\")","v":"Complies   /   Does Not Comply  /  N/A"}]
[null,"Average","Maximum","Minimum",null,"Average of 6 replicates"]
["Fine Particle Fraction, %",{"$f":"AVERAGE('ACI 1'!C33,'ACI 2'!C33,'ACI 3'!C33,'ACI 4'!C33,'ACI 5'!C33,'ACI 6'!C33)","v":{"$error":"#DIV/0!"}},{"$f":"MAX('ACI 1'!C33,'ACI 2'!C33,'ACI 3'!C33,'ACI 4'!C33,'ACI 5'!C33,'ACI 6'!C33)","v":{"v":0,"d":"0.0"}},{"$f":"MIN('ACI 1'!C33,'ACI 2'!C33,'ACI 3'!C33,'ACI 4'!C33,'ACI 5'!C33,'ACI 6'!C33)","v":{"v":0,"d":"0.0"}},null,{"$f":"IF(G39=\"N/A\", \"Not Applicable\", \"Complies   /   Does Not Comply  /  N/A\")","v":"Complies   /   Does Not Comply  /  N/A"}]
["%Mass Balance of Label Claim",{"$f":"AVERAGE('ACI 1'!C36,'ACI 2'!C36,'ACI 3'!C36,'ACI 4'!C36,'ACI 5'!C36,'ACI 6'!C36)","v":{"$error":"#DIV/0!"}},{"$f":"MAX('ACI 1'!C36,'ACI 2'!C36,'ACI 3'!C36,'ACI 4'!C36,'ACI 5'!C36,'ACI 6'!C36)","v":{"v":0,"d":"0.0"}},{"$f":"MIN('ACI 1'!C36,'ACI 2'!C36,'ACI 3'!C36,'ACI 4'!C36,'ACI 5'!C36,'ACI 6'!C36)","v":{"v":0,"d":"0.0"}}]
["MMAD, µm",{"$f":"AVERAGE('ACI 1'!B66,'ACI 2'!B66,'ACI 3'!B66,'ACI 4'!B66,'ACI 5'!B66,'ACI 6'!B66)","v":{"$error":"#DIV/0!"}},{"$f":"MAX('ACI 1'!B66,'ACI 2'!B66,'ACI 3'!B66,'ACI 4'!B66,'ACI 5'!B66,'ACI 6'!B66)","v":{"v":0,"d":"0.0"}},{"$f":"MIN('ACI 1'!B66,'ACI 2'!B66,'ACI 3'!B66,'ACI 4'!B66,'ACI 5'!B66,'ACI 6'!B66)","v":{"v":0,"d":"0.0"}}]
["GSD",{"$f":"AVERAGE('ACI 1'!B67,'ACI 2'!B67,'ACI 3'!B67,'ACI 4'!B67,'ACI 5'!B67,'ACI 6'!B67)","v":{"$error":"#DIV/0!"}},{"$f":"MAX('ACI 1'!B67,'ACI 2'!B67,'ACI 3'!B67,'ACI 4'!B67,'ACI 5'!B67,'ACI 6'!B67)","v":{"v":0,"d":"0.0"}},{"$f":"MIN('ACI 1'!B67,'ACI 2'!B67,'ACI 3'!B67,'ACI 4'!B67,'ACI 5'!B67,'ACI 6'!B67)","v":{"v":0,"d":"0.0"}}]
[]
[null,"Mannitol Recovered from Stage Groupings (mg)"]
["Stage Groupings","Minimum","Maximum","Mean","%RSD","Specification"]
["ATP to Stage -0",{"$f":"IF(B10=40, (MIN('ACI 1'!B71,'ACI 2'!B71,'ACI 3'!B71,'ACI 4'!B71,'ACI 5'!B71,'ACI 6'!B71)), \"N/A\")","v":"N/A"},{"$f":"IF(B10=40, (MAX('ACI 1'!B71,'ACI 2'!B71,'ACI 3'!B71,'ACI 4'!B71,'ACI 5'!B71,'ACI 6'!B71)), \"N/A\")","v":"N/A"},{"$f":"IF(B10=40, (AVERAGE('ACI 1'!B71,'ACI 2'!B71,'ACI 3'!B71,'ACI 4'!B71,'ACI 5'!B71,'ACI 6'!B71)), \"N/A\")","v":"N/A"},{"$f":"IF(B10=40, (100*STDEV('ACI 1'!B71,'ACI 2'!B71,'ACI 3'!B71,'ACI 4'!B71,'ACI 5'!B71,'ACI 6'!B71)/D50), \"N/A\")","v":"N/A"},"{Fill in Spec or N/A}",{"$f":"IF(AND(F50=\"N/A\",F51=\"N/A\",F52=\"N/A\",F53=\"N/A\"),\"Not Applicable\",\"Complies   / \n\n  Does Not Comply\")","v":"Complies   / \n\n  Does Not Comply"}]
["Stages 1 to 3",{"$f":"IF(B10=40, (MIN('ACI 1'!B72,'ACI 2'!B72,'ACI 3'!B72,'ACI 4'!B72,'ACI 5'!B72,'ACI 6'!B72)), \"N/A\")","v":"N/A"},{"$f":"IF(B10=40, (MAX('ACI 1'!B72,'ACI 2'!B72,'ACI 3'!B72,'ACI 4'!B72,'ACI 5'!B72,'ACI 6'!B72)), \"N/A\")","v":"N/A"},{"$f":"IF(B10=40, (AVERAGE('ACI 1'!B72,'ACI 2'!B72,'ACI 3'!B72,'ACI 4'!B72,'ACI 5'!B72,'ACI 6'!B72)), \"N/A\")","v":"N/A"},{"$f":"IF(B10=40, (100*STDEV('ACI 1'!B72,'ACI 2'!B72,'ACI 3'!B72,'ACI 4'!B72,'ACI 5'!B72,'ACI 6'!B72)/D51), \"N/A\")","v":"N/A"},"{Fill in Spec or N/A}"]
["Stages 4 to 6",{"$f":"IF(B10=40, (MIN('ACI 1'!B73,'ACI 2'!B73,'ACI 3'!B73,'ACI 4'!B73,'ACI 5'!B73,'ACI 6'!B73)), \"N/A\")","v":"N/A"},{"$f":"IF(B10=40, (MAX('ACI 1'!B73,'ACI 2'!B73,'ACI 3'!B73,'ACI 4'!B73,'ACI 5'!B73,'ACI 6'!B73)), \"N/A\")","v":"N/A"},{"$f":"IF(B10=40, (AVERAGE('ACI 1'!B73,'ACI 2'!B73,'ACI 3'!B73,'ACI 4'!B73,'ACI 5'!B73,'ACI 6'!B73)), \"N/A\")","v":"N/A"},{"$f":"IF(B10=40, (100*STDEV('ACI 1'!B73,'ACI 2'!B73,'ACI 3'!B73,'ACI 4'!B73,'ACI 5'!B73,'ACI 6'!B73)/D52), \"N/A\")","v":"N/A"},"{Fill in Spec or N/A}"]
["Filter",{"$f":"IF(B10=40, (MIN('ACI 1'!B74,'ACI 2'!B74,'ACI 3'!B74,'ACI 4'!B74,'ACI 5'!B74,'ACI 6'!B74)), \"N/A\")","v":"N/A"},{"$f":"IF(B10=40, (MAX('ACI 1'!B74,'ACI 2'!B74,'ACI 3'!B74,'ACI 4'!B74,'ACI 5'!B74,'ACI 6'!B74)), \"N/A\")","v":"N/A"},{"$f":"IF(B10=40, (AVERAGE('ACI 1'!B74,'ACI 2'!B74,'ACI 3'!B74,'ACI 4'!B74,'ACI 5'!B74,'ACI 6'!B74)), \"N/A\")","v":"N/A"},{"$f":"IF(B10=40, (100*STDEV('ACI 1'!B74,'ACI 2'!B74,'ACI 3'!B74,'ACI 4'!B74,'ACI 5'!B74,'ACI 6'!B74)/D53), \"N/A\")","v":"N/A"},"{Fill in Spec or N/A}"]
{"$rows_empty":21}
["Comments"]
[]
[]
[]
[]
["Sign & Date"]

{"sheet":"Trending","index":7,"n_rows":13,"n_cols":30,"rows_kept":13}
[{"$f":"'ACI 1'!A1","v":"QUALITY CONTROL DEPARTMENT"}]
[{"$f":"'ACI 1'!A2","v":"MES-013-07 Andersen Cascade Impactor Result Sheet for Flowrate of 60L/min"}]
[{"$f":"'ACI 1'!A3","v":"Associated Documents: TM-003"}]
[{"$f":"'ACI 1'!A4","v":"To be used with Excel 2016 only. Last Modified by P. Lillo 05-Feb-19."}]
[]
["Result Type","Capsule","Inhaler","ATP","Stage -1","Stage -0","Stage 1","Stage 2","Stage 3","Stage 4","Stage 5","Stage 6","Filter ","Casing","Total Mass (mg)","Amount emitted to ACI","Recovery","Recovery %, DU result","Recovery % Fill wt","FPD (mg)","FPF (%)","MMAD, µm","GSD","Size at 15.87% µm","Size at 84.13% µm","Development/Investigation\nDescription (ie TP Ref)","ATP to\nStage -0","Stage 1 to Stage 3","Stage 4 to Stage 6","%Mass Balance of LC"]
["Replicate 1",{"$f":"IF('ACI 1'!E19=\"N/A\",\"*\", ROUND('ACI 1'!E19,4))","v":"*"},{"$f":"IF('ACI 1'!E20=\"N/A\",\"*\", ROUND('ACI 1'!E20,4))","v":"*"},{"$f":"ROUND('ACI 1'!$E$21,4)","v":{"$error":"#VALUE!"}},{"$f":"ROUND('ACI 1'!$E$22,4)","v":{"$error":"#VALUE!"}},{"$f":"ROUND('ACI 1'!$E$23,4)","v":{"$error":"#VALUE!"}},{"$f":"ROUND('ACI 1'!$E$24,4)","v":{"$error":"#VALUE!"}},{"$f":"ROUND('ACI 1'!$E$25,4)","v":{"$error":"#VALUE!"}},{"$f":"ROUND('ACI 1'!$E$26,4)","v":{"$error":"#VALUE!"}},{"$f":"ROUND('ACI 1'!$E$27,4)","v":{"$error":"#VALUE!"}},{"$f":"ROUND('ACI 1'!$E$28,4)","v":{"$error":"#VALUE!"}},{"$f":"ROUND('ACI 1'!$E$29,4)","v":{"$error":"#VALUE!"}},{"$f":"ROUND('ACI 1'!$E$30,4)","v":{"$error":"#VALUE!"}},{"$f":"ROUND('ACI 1'!$E$31,4)","v":{"$error":"#VALUE!"}},{"$f":"IF('ACI 1'!C34=\"N/A\",\"*\",ROUND('ACI 1'!C34,4))","v":"*"},{"$f":"ROUND('ACI 1'!C35,4)","v":{"$error":"#VALUE!"}},{"$f":"IF('ACI 1'!C34=\"N/A\", \"% of DU\", \"Full Recovery\")","v":"% of DU"},{"$f":"ROUND('ACI 1'!C38,2)","v":{"$error":"#VALUE!"}},{"$f":"IF('ACI 1'!C37=\"N/A\",\"*\",ROUND('ACI 1'!C37,2))","v":"*"},{"$f":"ROUND('ACI 1'!D57,4)","v":{"$error":"#VALUE!"}},{"$f":"IF('ACI 1'!C33=\"N/A\", \"*\",ROUND('ACI 1'!C33,4))","v":"*"},{"$f":"ROUND('ACI 1'!B66,4)","v":{"$error":"#VALUE!"}},{"$f":"ROUND('ACI 1'!B67,4)","v":{"$error":"#VALUE!"}},{"$f":"ROUND('ACI 1'!E63,4)","v":{"$error":"#VALUE!"}},{"$f":"ROUND('ACI 1'!E64,4)","v":{"$error":"#VALUE!"}},"{Fill In}",{"$f":"IF('ACI 1'!B71=\"N/A\",\"*\",ROUND('ACI 1'!B71,4))","v":"*"},{"$f":"IF('ACI 1'!B72=\"N/A\",\"*\",ROUND('ACI 1'!B72,4))","v":"*"},{"$f":"IF('ACI 1'!B73=\"N/A\",\"*\",ROUND('ACI 1'!B73,4))","v":"*"},{"$f":"ROUND('ACI 1'!C36,4)","v":{"$error":"#VALUE!"}}]
["Replicate 2",{"$f":"IF('ACI 2'!E19=\"N/A\",\"*\", ROUND('ACI 2'!E19,4))","v":"*"},{"$f":"IF('ACI 2'!E20=\"N/A\",\"*\", ROUND('ACI 2'!E20,4))","v":"*"},{"$f":"ROUND('ACI 2'!$E$21,4)","v":{"$error":"#VALUE!"}},{"$f":"ROUND('ACI 2'!$E$22,4)","v":{"$error":"#VALUE!"}},{"$f":"ROUND('ACI 2'!$E$23,4)","v":{"$error":"#VALUE!"}},{"$f":"ROUND('ACI 2'!$E$24,4)","v":{"$error":"#VALUE!"}},{"$f":"ROUND('ACI 2'!$E$25,4)","v":{"$error":"#VALUE!"}},{"$f":"ROUND('ACI 2'!$E$26,4)","v":{"$error":"#VALUE!"}},{"$f":"ROUND('ACI 2'!$E$27,4)","v":{"$error":"#VALUE!"}},{"$f":"ROUND('ACI 2'!$E$28,4)","v":{"$error":"#VALUE!"}},{"$f":"ROUND('ACI 2'!$E$29,4)","v":{"$error":"#VALUE!"}},{"$f":"ROUND('ACI 2'!$E$30,4)","v":{"$error":"#VALUE!"}},{"$f":"ROUND('ACI 2'!$E$31,4)","v":{"$error":"#VALUE!"}},{"$f":"IF('ACI 2'!C34=\"N/A\",\"*\",ROUND('ACI 2'!C34,4))","v":"*"},{"$f":"ROUND('ACI 2'!C35,4)","v":{"$error":"#VALUE!"}},{"$f":"IF('ACI 2'!C34=\"N/A\", \"% of DU\", \"Full Recovery\")","v":"% of DU"},{"$f":"ROUND('ACI 2'!C38,2)","v":{"$error":"#VALUE!"}},{"$f":"IF('ACI 2'!C37=\"N/A\",\"*\",ROUND('ACI 2'!C37,2))","v":"*"},{"$f":"ROUND('ACI 2'!D57,4)","v":{"$error":"#VALUE!"}},{"$f":"IF('ACI 2'!C33=\"N/A\", \"*\",ROUND('ACI 2'!C33,4))","v":"*"},{"$f":"ROUND('ACI 2'!B66,4)","v":{"$error":"#VALUE!"}},{"$f":"ROUND('ACI 2'!B67,4)","v":{"$error":"#VALUE!"}},{"$f":"ROUND('ACI 2'!E63,4)","v":{"$error":"#VALUE!"}},{"$f":"ROUND('ACI 2'!E64,4)","v":{"$error":"#VALUE!"}},"{Fill In}",{"$f":"IF('ACI 2'!B71=\"N/A\",\"*\",ROUND('ACI 2'!B71,4))","v":"*"},{"$f":"IF('ACI 2'!B72=\"N/A\",\"*\",ROUND('ACI 2'!B72,4))","v":"*"},{"$f":"IF('ACI 2'!B73=\"N/A\",\"*\",ROUND('ACI 2'!B73,4))","v":"*"},{"$f":"ROUND('ACI 2'!C36,4)","v":{"$error":"#VALUE!"}}]
["Replicate 3",{"$f":"IF('ACI 3'!E19=\"N/A\",\"*\", ROUND('ACI 3'!E19,4))","v":"*"},{"$f":"IF('ACI 3'!E20=\"N/A\",\"*\", ROUND('ACI 3'!E20,4))","v":"*"},{"$f":"ROUND('ACI 3'!$E$21,4)","v":{"$error":"#VALUE!"}},{"$f":"ROUND('ACI 3'!$E$22,4)","v":{"$error":"#VALUE!"}},{"$f":"ROUND('ACI 3'!$E$23,4)","v":{"$error":"#VALUE!"}},{"$f":"ROUND('ACI 3'!$E$24,4)","v":{"$error":"#VALUE!"}},{"$f":"ROUND('ACI 3'!$E$25,4)","v":{"$error":"#VALUE!"}},{"$f":"ROUND('ACI 3'!$E$26,4)","v":{"$error":"#VALUE!"}},{"$f":"ROUND('ACI 3'!$E$27,4)","v":{"$error":"#VALUE!"}},{"$f":"ROUND('ACI 3'!$E$28,4)","v":{"$error":"#VALUE!"}},{"$f":"ROUND('ACI 3'!$E$29,4)","v":{"$error":"#VALUE!"}},{"$f":"ROUND('ACI 3'!$E$30,4)","v":{"$error":"#VALUE!"}},{"$f":"ROUND('ACI 3'!$E$31,4)","v":{"$error":"#VALUE!"}},{"$f":"IF('ACI 3'!C34=\"N/A\",\"*\",ROUND('ACI 3'!C34,4))","v":"*"},{"$f":"ROUND('ACI 3'!C35,4)","v":{"$error":"#VALUE!"}},{"$f":"IF('ACI 3'!C34=\"N/A\", \"% of DU\", \"Full Recovery\")","v":"% of DU"},{"$f":"ROUND('ACI 3'!C38,2)","v":{"$error":"#VALUE!"}},{"$f":"IF('ACI 3'!C37=\"N/A\",\"*\",ROUND('ACI 3'!C37,2))","v":"*"},{"$f":"ROUND('ACI 3'!D57,4)","v":{"$error":"#VALUE!"}},{"$f":"IF('ACI 3'!C33=\"N/A\", \"*\",ROUND('ACI 3'!C33,4))","v":"*"},{"$f":"ROUND('ACI 3'!B66,4)","v":{"$error":"#VALUE!"}},{"$f":"ROUND('ACI 3'!B67,4)","v":{"$error":"#VALUE!"}},{"$f":"ROUND('ACI 3'!E63,4)","v":{"$error":"#VALUE!"}},{"$f":"ROUND('ACI 3'!E64,4)","v":{"$error":"#VALUE!"}},"{Fill In}",{"$f":"IF('ACI 3'!B71=\"N/A\",\"*\",ROUND('ACI 3'!B71,4))","v":"*"},{"$f":"IF('ACI 3'!B72=\"N/A\",\"*\",ROUND('ACI 3'!B72,4))","v":"*"},{"$f":"IF('ACI 3'!B73=\"N/A\",\"*\",ROUND('ACI 3'!B73,4))","v":"*"},{"$f":"ROUND('ACI 3'!C36,4)","v":{"$error":"#VALUE!"}}]
["Replicate 4",{"$f":"IF('ACI 4'!E19=\"N/A\",\"*\", ROUND('ACI 4'!E19,4))","v":"*"},{"$f":"IF('ACI 4'!E20=\"N/A\",\"*\", ROUND('ACI 4'!E20,4))","v":"*"},{"$f":"ROUND('ACI 4'!$E$21,4)","v":{"$error":"#VALUE!"}},{"$f":"ROUND('ACI 4'!$E$22,4)","v":{"$error":"#VALUE!"}},{"$f":"ROUND('ACI 4'!$E$23,4)","v":{"$error":"#VALUE!"}},{"$f":"ROUND('ACI 4'!$E$24,4)","v":{"$error":"#VALUE!"}},{"$f":"ROUND('ACI 4'!$E$25,4)","v":{"$error":"#VALUE!"}},{"$f":"ROUND('ACI 4'!$E$26,4)","v":{"$error":"#VALUE!"}},{"$f":"ROUND('ACI 4'!$E$27,4)","v":{"$error":"#VALUE!"}},{"$f":"ROUND('ACI 4'!$E$28,4)","v":{"$error":"#VALUE!"}},{"$f":"ROUND('ACI 4'!$E$29,4)","v":{"$error":"#VALUE!"}},{"$f":"ROUND('ACI 4'!$E$30,4)","v":{"$error":"#VALUE!"}},{"$f":"ROUND('ACI 4'!$E$31,4)","v":{"$error":"#VALUE!"}},{"$f":"IF('ACI 4'!C34=\"N/A\",\"*\",ROUND('ACI 4'!C34,4))","v":"*"},{"$f":"ROUND('ACI 4'!C35,4)","v":{"$error":"#VALUE!"}},{"$f":"IF('ACI 4'!C34=\"N/A\", \"% of DU\", \"Full Recovery\")","v":"% of DU"},{"$f":"ROUND('ACI 4'!C38,2)","v":{"$error":"#VALUE!"}},{"$f":"IF('ACI 4'!C37=\"N/A\",\"*\",ROUND('ACI 4'!C37,2))","v":"*"},{"$f":"ROUND('ACI 4'!D57,4)","v":{"$error":"#VALUE!"}},{"$f":"IF('ACI 4'!C33=\"N/A\", \"*\",ROUND('ACI 4'!C33,4))","v":"*"},{"$f":"ROUND('ACI 4'!B66,4)","v":{"$error":"#VALUE!"}},{"$f":"ROUND('ACI 4'!B67,4)","v":{"$error":"#VALUE!"}},{"$f":"ROUND('ACI 4'!E63,4)","v":{"$error":"#VALUE!"}},{"$f":"ROUND('ACI 4'!E64,4)","v":{"$error":"#VALUE!"}},"{Fill In}",{"$f":"IF('ACI 4'!B71=\"N/A\",\"*\",ROUND('ACI 4'!B71,4))","v":"*"},{"$f":"IF('ACI 4'!B72=\"N/A\",\"*\",ROUND('ACI 4'!B72,4))","v":"*"},{"$f":"IF('ACI 4'!B73=\"N/A\",\"*\",ROUND('ACI 4'!B73,4))","v":"*"},{"$f":"ROUND('ACI 4'!C36,4)","v":{"$error":"#VALUE!"}}]
["Replicate 5",{"$f":"IF('ACI 5'!E19=\"N/A\",\"*\", ROUND('ACI 5'!E19,4))","v":"*"},{"$f":"IF('ACI 5'!E20=\"N/A\",\"*\", ROUND('ACI 5'!E20,4))","v":"*"},{"$f":"ROUND('ACI 5'!$E$21,4)","v":{"$error":"#VALUE!"}},{"$f":"ROUND('ACI 5'!$E$22,4)","v":{"$error":"#VALUE!"}},{"$f":"ROUND('ACI 5'!$E$23,4)","v":{"$error":"#VALUE!"}},{"$f":"ROUND('ACI 5'!$E$24,4)","v":{"$error":"#VALUE!"}},{"$f":"ROUND('ACI 5'!$E$25,4)","v":{"$error":"#VALUE!"}},{"$f":"ROUND('ACI 5'!$E$26,4)","v":{"$error":"#VALUE!"}},{"$f":"ROUND('ACI 5'!$E$27,4)","v":{"$error":"#VALUE!"}},{"$f":"ROUND('ACI 5'!$E$28,4)","v":{"$error":"#VALUE!"}},{"$f":"ROUND('ACI 5'!$E$29,4)","v":{"$error":"#VALUE!"}},{"$f":"ROUND('ACI 5'!$E$30,4)","v":{"$error":"#VALUE!"}},{"$f":"ROUND('ACI 5'!$E$31,4)","v":{"$error":"#VALUE!"}},{"$f":"IF('ACI 5'!C34=\"N/A\",\"*\",ROUND('ACI 5'!C34,4))","v":"*"},{"$f":"ROUND('ACI 5'!C35,4)","v":{"$error":"#VALUE!"}},{"$f":"IF('ACI 5'!C34=\"N/A\", \"% of DU\", \"Full Recovery\")","v":"% of DU"},{"$f":"ROUND('ACI 5'!C38,2)","v":{"$error":"#VALUE!"}},{"$f":"IF('ACI 5'!C37=\"N/A\",\"*\",ROUND('ACI 5'!C37,2))","v":"*"},{"$f":"ROUND('ACI 5'!D57,4)","v":{"$error":"#VALUE!"}},{"$f":"IF('ACI 5'!C33=\"N/A\", \"*\",ROUND('ACI 5'!C33,4))","v":"*"},{"$f":"ROUND('ACI 5'!B66,4)","v":{"$error":"#VALUE!"}},{"$f":"ROUND('ACI 5'!B67,4)","v":{"$error":"#VALUE!"}},{"$f":"ROUND('ACI 5'!E63,4)","v":{"$error":"#VALUE!"}},{"$f":"ROUND('ACI 5'!E64,4)","v":{"$error":"#VALUE!"}},"{Fill In}",{"$f":"IF('ACI 5'!B71=\"N/A\",\"*\",ROUND('ACI 5'!B71,4))","v":"*"},{"$f":"IF('ACI 5'!B72=\"N/A\",\"*\",ROUND('ACI 5'!B72,4))","v":"*"},{"$f":"IF('ACI 5'!B73=\"N/A\",\"*\",ROUND('ACI 5'!B73,4))","v":"*"},{"$f":"ROUND('ACI 5'!C36,4)","v":{"$error":"#VALUE!"}}]
["Replicate 6",{"$f":"IF('ACI 6'!E19=\"N/A\",\"*\", ROUND('ACI 6'!E19,4))","v":"*"},{"$f":"IF('ACI 6'!E20=\"N/A\",\"*\", ROUND('ACI 6'!E20,4))","v":"*"},{"$f":"ROUND('ACI 6'!$E$21,4)","v":{"$error":"#VALUE!"}},{"$f":"ROUND('ACI 6'!$E$22,4)","v":{"$error":"#VALUE!"}},{"$f":"ROUND('ACI 6'!$E$23,4)","v":{"$error":"#VALUE!"}},{"$f":"ROUND('ACI 6'!$E$24,4)","v":{"$error":"#VALUE!"}},{"$f":"ROUND('ACI 6'!$E$25,4)","v":{"$error":"#VALUE!"}},{"$f":"ROUND('ACI 6'!$E$26,4)","v":{"$error":"#VALUE!"}},{"$f":"ROUND('ACI 6'!$E$27,4)","v":{"$error":"#VALUE!"}},{"$f":"ROUND('ACI 6'!$E$28,4)","v":{"$error":"#VALUE!"}},{"$f":"ROUND('ACI 6'!$E$29,4)","v":{"$error":"#VALUE!"}},{"$f":"ROUND('ACI 6'!$E$30,4)","v":{"$error":"#VALUE!"}},{"$f":"ROUND('ACI 6'!$E$31,4)","v":{"$error":"#VALUE!"}},{"$f":"IF('ACI 6'!C34=\"N/A\",\"*\",ROUND('ACI 6'!C34,4))","v":"*"},{"$f":"ROUND('ACI 6'!C35,4)","v":{"$error":"#VALUE!"}},{"$f":"IF('ACI 6'!C34=\"N/A\", \"% of DU\", \"Full Recovery\")","v":"% of DU"},{"$f":"ROUND('ACI 6'!C38,2)","v":{"$error":"#VALUE!"}},{"$f":"IF('ACI 6'!C37=\"N/A\",\"*\",ROUND('ACI 6'!C37,2))","v":"*"},{"$f":"ROUND('ACI 6'!D57,4)","v":{"$error":"#VALUE!"}},{"$f":"IF('ACI 6'!C33=\"N/A\", \"*\",ROUND('ACI 6'!C33,4))","v":"*"},{"$f":"ROUND('ACI 6'!B66,4)","v":{"$error":"#VALUE!"}},{"$f":"ROUND('ACI 6'!B67,4)","v":{"$error":"#VALUE!"}},{"$f":"ROUND('ACI 6'!E63,4)","v":{"$error":"#VALUE!"}},{"$f":"ROUND('ACI 6'!E64,4)","v":{"$error":"#VALUE!"}},"{Fill In}",{"$f":"IF('ACI 6'!B71=\"N/A\",\"*\",ROUND('ACI 6'!B71,4))","v":"*"},{"$f":"IF('ACI 6'!B72=\"N/A\",\"*\",ROUND('ACI 6'!B72,4))","v":"*"},{"$f":"IF('ACI 6'!B73=\"N/A\",\"*\",ROUND('ACI 6'!B73,4))","v":"*"},{"$f":"ROUND('ACI 6'!C36,4)","v":{"$error":"#VALUE!"}}]
["Average",{"$f":"IF(B7=\"*\", \"*\",ROUND('Average ACI'!B26,4))","v":"*"},{"$f":"IF(C7=\"*\", \"*\",ROUND('Average ACI'!B27,4))","v":"*"},{"$f":"ROUND('Average ACI'!B28,4)","v":{"$error":"#DIV/0!"}},{"$f":"ROUND('Average ACI'!B29,4)","v":{"$error":"#DIV/0!"}},{"$f":"ROUND('Average ACI'!B30,4)","v":{"$error":"#DIV/0!"}},{"$f":"ROUND('Average ACI'!B31,4)","v":{"$error":"#DIV/0!"}},{"$f":"ROUND('Average ACI'!B32,4)","v":{"$error":"#DIV/0!"}},{"$f":"ROUND('Average ACI'!B33,4)","v":{"$error":"#DIV/0!"}},{"$f":"ROUND('Average ACI'!B34,4)","v":{"$error":"#DIV/0!"}},{"$f":"ROUND('Average ACI'!B35,4)","v":{"$error":"#DIV/0!"}},{"$f":"ROUND('Average ACI'!B36,4)","v":{"$error":"#DIV/0!"}},{"$f":"ROUND('Average ACI'!B37,4)","v":{"$error":"#DIV/0!"}},{"$f":"ROUND('Average ACI'!B38,4)","v":{"$error":"#DIV/0!"}},{"$f":"IF(O7=\"*\", \"*\", ROUND(AVERAGE(O7:O12),4))","v":"*"},{"$f":"IF(P7=\"N/A\",\"N/A\",(ROUND('Average ACI'!B39,4)))","v":{"$error":"#VALUE!"}},{"$f":"IF('ACI 1'!C34=\"N/A\", \"% of DU\", \"Full Recovery\")","v":"% of DU"},"*","*",{"$f":"IF(T7=\"N/A\",\"N/A\",(ROUND('Average ACI'!B40,4)))","v":{"$error":"#VALUE!"}},{"$f":"IF(U7=\"*\",\"*\",(ROUND('Average ACI'!B43,4)))","v":"*"},{"$f":"IF(V7=\"N/A\",\"N/A\",(ROUND('Average ACI'!B45,4)))","v":{"$error":"#VALUE!"}},{"$f":"IF(W7=\"N/A\",\"N/A\",(ROUND('Average ACI'!B46,4)))","v":{"$error":"#VALUE!"}},"*","*","{Fill In}",{"$f":"IF(AA7=\"*\",\"*\",ROUND('Average ACI'!D50,4))","v":"*"},{"$f":"IF(AB7=\"*\",\"*\",ROUND('Average ACI'!D51,4))","v":"*"},{"$f":"IF(AC7=\"*\",\"*\",ROUND('Average ACI'!D52,4))","v":"*"},{"$f":"ROUND('Average ACI'!B44,4)","v":{"$error":"#DIV/0!"}}]